program: Gaussian 09
title: 000281996
version: EM64L-G09RevD.01
frameworkgroup: C1[X(C11H16N4O)]
method: RPBEPBE
basis: SDD
operation: Freq
keyword: #p
keyword: freq=noraman
keyword: PBEPBE/SDD
title: #p freq=noraman PBEPBE/SDD
converged: YES YES NO NO
title: Mulliken charges:
elementType: O N N N N C C C C C C C C C C C H H H H H H H H H H H H H H H H
charge: -0.247605 0.007324 -0.023753 -0.397258 -0.650010 -0.535033 -0.368743 0.093762 0.336938 -0.675597 -0.284522 -0.547595 -0.298275 0.140030 -0.777278 0.298898 0.239853 0.195137 0.207883 0.236295 0.229307 0.200741 0.218404 0.298898 0.235168 0.235834 0.227382 0.228015 0.252515 0.275893 0.301090 0.346302
chargesum: 0.00000
title: Mulliken charges with hydrogens summed into heavy atoms:
elementType: O N N N N C C C C C C C C C C C
charge: -0.247605 0.007324 -0.023753 -0.121365 -0.002618 -0.100043 0.075435 0.093762 0.336938 -0.027145 0.014376 -0.312427 -0.062441 0.140030 -0.069365 0.298898
polarizability: 2.61133132e+02 -3.03182966e+00 1.64015993e+02 -3.09206907e+00 -8.65648599e+00 8.32805612e+01
1716.lowfreq: -13.1718 -6.6199 0.0004 0.0005 0.0007 1.6363 25.7889 31.0763 43.7694
frequency: 25.7397 30.8686 43.7323 47.2190 54.7855 70.4344 89.5937 113.4660 171.5227 203.3534 219.4585 224.1072 261.7415 282.8777 289.1017 337.7517 362.3835 368.4157 406.5655 445.4467 483.8518 495.3071 508.5745 547.9459 588.6365 614.5640 633.2643 667.6122 709.5323 731.6868 746.1301 756.8493 815.8150 859.7487 872.1771 884.6838 909.2613 930.7870 976.8621 990.0014 1012.0149 1016.9931 1042.0825 1047.2056 1051.0204 1088.4236 1100.0913 1135.1199 1148.2589 1217.8732 1249.3439 1275.0047 1283.1055 1289.3897 1302.8812 1318.1330 1328.8933 1338.6518 1358.8878 1389.8671 1392.0171 1455.1200 1467.5449 1469.1941 1474.1395 1477.6653 1482.9377 1491.2977 1522.1707 1533.0663 1563.6078 1593.4693 1604.4818 1684.1886 2953.5794 2973.7689 2980.6025 2985.2653 3029.8106 3050.4860 3057.2915 3071.8035 3078.6773 3115.6856 3121.8789 3138.9914 3169.0458 3402.7280 3538.1758 3695.6748
redmass: 3.9927 3.9922 3.3585 1.3538 2.4266 4.9700 1.6839 4.0462 4.2713 3.4033 1.9873 1.2865 4.6042 3.2999 2.0962 2.8277 2.9713 3.0290 3.1084 3.1978 1.5703 1.8850 2.6384 1.5925 3.9607 4.7558 7.5380 5.9890 8.4502 1.6039 2.7677 1.8422 5.0476 1.4686 1.4311 1.8220 1.4966 2.7870 1.5385 3.9522 1.3566 2.1696 2.5206 1.5948 2.7248 2.1710 1.9205 2.0730 1.8776 1.4553 2.6359 1.3588 1.1849 2.4846 1.7400 7.7142 2.1833 1.5004 2.4180 1.2640 1.2112 1.1923 1.4993 1.0472 1.0430 1.0623 1.3618 1.5362 1.3663 4.3460 7.7129 6.0412 1.2324 5.4225 1.0692 1.0363 1.0382 1.0628 1.0944 1.0951 1.0971 1.1007 1.0994 1.0980 1.0901 1.0900 1.0966 1.0745 1.0460 1.1035
irintensity: 13.9477 8.1206 1.7336 0.3591 0.6490 6.8256 0.3052 0.0587 2.2907 1.5675 1.4604 0.3533 0.5608 3.5409 8.3578 1.4125 3.8877 50.1198 18.3984 24.7871 160.6008 72.3311 5.6427 95.2546 10.7592 8.0249 1.4521 6.4524 17.2615 6.7872 4.3688 1.3344 0.4699 21.4856 11.3129 7.9585 4.0818 2.5758 12.3377 14.3940 1.7259 2.8312 32.5858 9.8622 15.0689 20.7383 3.4542 86.4966 99.2613 8.3305 5.3652 3.1842 3.9570 525.0107 5.8344 0.0805 23.5445 4.5064 43.0170 18.8525 11.0443 28.9017 343.3413 15.5197 2.4843 50.3462 57.1464 25.9870 43.0301 54.1735 38.3205 72.3350 113.5180 270.7240 27.4734 39.9799 26.7745 23.3465 3.3811 7.6595 20.3808 65.9222 41.7689 10.7120 36.0892 11.1752 3.8749 11.1999 60.8631 47.5069
temp: 298.150 k
press: 1.00000 atm
elementType: 8 7 7 7 7 6 6 6 6 6 6 6 6 6 6 6 1 1 1 1 1 1 1 1 1 1 1 1 1 1 1 1
symmnumber: 1
zpe: 683901.9 jmol-1
zpe.correction: 0.260484 hartree
zpe.thermalcorrener: 0.277783 hartree
zpe.thermalcorrenthalpy: 0.278727 hartree
zpe.thermalcorrgfe: 0.212808 hartree
zpe.sumelectzpe: -721.788290 hartree
zpe.sumelectthermal: -721.770992 hartree
zpe.sumelectthermalent: -721.770048 hartree
zpe.sumelectthermalfe: -721.835967 hartree
dipole: 3.7945 3.7735 -0.6456
dipole: 5.3902
quadrupole: -72.7625 -101.4753 -98.3562
quadrupole: 18.4983 -3.9974 0.1605
quadrupole: 18.1022 -10.6106 -7.4915 18.4983 -3.9974 0.1605
hfenergy: -722.0487748 hartree
pointgroup: C01 [X(C11H16N4O1)]
dipole: -1.4269823 1.5496638 0.2439168 debye
polarizability: 261.0937079|-0.91682|164.2584337|-5.4320226|7.1223305|83.0775448 unknown
InChI: InChI=1S/C11H16N4O/c1-3-4-10(14-15-11(12)16)9-6-5-8(2)13-7-9/h5-7,15H,3-4,12H2,1-2H3
charge 0 multiplicity 1
32 atoms
O  -3.232012 -2.5900 -0.104581
N  -1.283769 -0.59165 0.179935
N  3.398693 0.626117 0.148349
N  -2.630792 -0.327327 0.266491
N  -4.881574 -0.966753 0.191832
C  -0.791441 1.831821 0.671194
C  -1.053784 2.674576 -0.612149
C  -0.40917 0.387657 0.368416
C  1.016912 -0.002596 0.226338
C  -1.482754 4.119849 -0.283366
C  1.388801 -1.365092 0.020997
C  2.076346 0.942752 0.274181
C  2.743868 -1.702714 -0.10891
C  3.739482 -0.686264 -0.038431
C  5.213341 -1.005741 -0.168645
C  -3.554649 -1.394439 0.100802
H  0.004395 2.316808 1.26302
H  -1.692713 1.868331 1.321098
H  -1.827447 2.181408 -1.233561
H  -0.133272 2.688098 -1.226135
H  -1.651146 4.704798 -1.205441
H  -2.420694 4.139624 0.304242
H  -0.706659 4.640061 0.308489
H  0.599461 -2.120691 -0.030653
H  1.876331 2.011409 0.414507
H  3.044152 -2.744792 -0.262974
H  5.539998 -1.720573 0.609932
H  5.439031 -1.466597 -1.148946
H  5.800812 -0.079982 -0.069932
H  -2.979823 0.618413 0.471555
H  -5.169198 0.00053 0.325509
H  -5.596025 -1.682643 0.087937
