program: Gaussian 09
title: 000281974
version: EM64L-G09RevD.01
frameworkgroup: C1[X(C11H16)]
method: RPBEPBE
basis: SDD
operation: Freq
keyword: #p
keyword: freq=noraman
keyword: PBEPBE/SDD
title: #p freq=noraman PBEPBE/SDD
converged: YES YES NO NO
title: Mulliken charges:
elementType: C C C C C C C C C C C H H H H H H H H H H H H H H H H
charge: -0.168523 -0.422067 0.457008 -0.449806 -0.406941 -0.593520 -0.392569 -0.588172 -0.619519 0.617779 -0.786997 0.215368 0.199686 0.203014 0.205918 0.206152 0.209434 0.190439 0.220954 0.207008 0.204183 0.204239 0.211684 0.215701 0.225748 0.214676 0.219122
chargesum: 0.00000
title: Mulliken charges with hydrogens summed into heavy atoms:
elementType: C C C C C C C C C C C
charge: 0.046845 -0.019367 0.457008 -0.037736 -0.007068 -0.165558 0.015853 -0.160786 -0.393770 0.617779 -0.353199
polarizability: 1.69129087e+02 -9.35963722e+00 1.08678260e+02 -9.58709159e+00 3.80928817e+00 8.05746243e+01
1716.lowfreq: -12.6146 -0.0004 -0.0003 0.0003 10.9893 14.3408 64.8827 126.2798 180.4237
frequency: 64.8561 126.2738 180.4202 224.0562 264.3912 316.5484 320.3088 387.4109 399.5888 414.4474 469.8772 506.7546 522.1071 609.6038 652.2316 692.6049 729.8671 785.3265 828.9220 851.6242 859.3545 878.5238 901.6143 917.9803 931.5513 964.2441 983.0565 987.6532 1026.5324 1051.6221 1086.5780 1091.0337 1094.8264 1123.3215 1144.0406 1164.7650 1193.3362 1213.9593 1240.7386 1248.9960 1271.3008 1302.1935 1311.2455 1316.5224 1326.5769 1333.9385 1338.9437 1344.0158 1350.7531 1368.3107 1435.6985 1452.5454 1457.8810 1459.5234 1466.7308 1468.5525 1476.8664 1619.5881 1652.7550 2906.7535 2934.3164 2961.8624 2963.8458 2965.3649 2976.3267 2976.4307 3023.0317 3027.2967 3030.7903 3035.5272 3043.0688 3044.2596 3085.7725 3087.8714 3189.6161
redmass: 2.9888 2.4669 2.7773 2.0511 2.7315 2.2289 1.9611 3.3972 2.5690 2.8349 2.6035 2.8809 2.0914 2.7432 2.8511 1.0742 2.5892 1.9442 1.6915 2.1208 2.1917 1.4587 1.4175 2.2916 1.4767 1.8770 1.5790 1.9202 2.0647 1.6979 1.9844 1.6957 1.5789 1.6169 2.0437 1.3640 1.6067 1.2891 1.3773 1.2528 1.2270 1.3083 1.3973 1.4013 1.3784 1.7036 1.4812 1.5865 1.9758 2.1424 1.2190 1.0917 1.0976 1.0926 1.0865 1.0923 1.0906 5.5829 6.5791 1.0806 1.0665 1.0657 1.0589 1.0648 1.0616 1.0597 1.0980 1.0955 1.0977 1.0998 1.1016 1.1006 1.0701 1.0812 1.1139
irintensity: 0.0224 0.5097 0.8912 0.4568 0.3043 0.3456 1.3564 1.2497 0.7795 0.2093 0.2095 0.8075 1.1313 7.9581 0.8776 0.9254 2.6661 0.3835 9.2360 3.7272 2.6606 2.5945 9.8922 14.3789 77.0386 1.0527 1.0457 8.6929 1.5868 3.6858 1.9235 0.0831 0.6106 1.1579 3.2238 3.3454 0.9799 1.4696 3.5871 3.0898 1.9702 6.4451 1.1372 1.1970 1.1146 0.2066 1.9181 0.8166 1.0025 4.0639 4.8786 11.9818 10.6371 0.7751 9.1253 13.9589 9.9770 4.8359 44.9075 18.8044 35.5806 28.0817 26.6344 33.7942 39.1542 55.1237 58.1581 19.4927 57.8012 69.1022 24.6186 107.6122 7.1119 22.8493 21.2343
temp: 298.150 k
press: 1.00000 atm
elementType: 6 6 6 6 6 6 6 6 6 6 6 1 1 1 1 1 1 1 1 1 1 1 1 1 1 1 1
symmnumber: 1
zpe: 630773.1 jmol-1
zpe.correction: 0.240249 hartree
zpe.thermalcorrener: 0.250080 hartree
zpe.thermalcorrenthalpy: 0.251024 hartree
zpe.thermalcorrgfe: 0.205550 hartree
zpe.sumelectzpe: -427.906631 hartree
zpe.sumelectthermal: -427.896800 hartree
zpe.sumelectthermalent: -427.895856 hartree
zpe.sumelectthermalfe: -427.941330 hartree
dipole: -1.2148 0.5669 0.3502
dipole: 1.3856
quadrupole: -68.0814 -65.3307 -69.4403
quadrupole: 1.6462 -0.4583 0.9467
quadrupole: -0.4640 2.2868 -1.8228 1.6462 -0.4583 0.9467
hfenergy: -428.14688 hartree
pointgroup: C01 [X(C11H16)]
dipole: 0.4796382 -0.2179066 0.1400786 debye
polarizability: 169.2682624|-8.787623|108.4575169|9.7217843|-4.0164854|80.6561925 unknown
InChI: InChI=1S/C11H16/c1-9-6-7-10-4-2-3-5-11(10)8-9/h8,10H,1-7H2
charge 0 multiplicity 1
27 atoms
C  0.465368 -0.88688 0.36223
C  1.754823 -1.324769 -0.393222
C  0.225039 0.617545 0.216962
C  -0.751107 -1.716444 -0.120024
C  2.979551 -0.44966 -0.048754
C  1.433954 1.519444 0.411453
C  2.686694 1.034485 -0.363951
C  -2.090804 -1.130325 0.379248
C  -1.021814 1.128931 -0.034022
C  -2.24919 0.317831 -0.069781
C  -3.456201 0.84734 -0.430483
H  0.634283 -1.095544 1.444813
H  1.563338 -1.258365 -1.484455
H  1.959721 -2.39002 -0.167074
H  -0.640456 -2.765877 0.216255
H  -0.754102 -1.728846 -1.228608
H  3.86597 -0.796208 -0.614354
H  3.223353 -0.555654 1.029067
H  1.1804 2.560424 0.135193
H  1.692602 1.53295 1.493937
H  2.514148 1.148448 -1.453096
H  3.556289 1.667817 -0.102156
H  -2.10322 -1.162277 1.489182
H  -2.94374 -1.740263 0.029129
H  -1.135111 2.213197 -0.181075
H  -4.369978 0.241924 -0.443449
H  -3.555708 1.900694 -0.720463
