program: Gaussian 09
title: 000281973
version: EM64L-G09RevD.01
frameworkgroup: C1[X(C10H16O)]
method: RPBEPBE
basis: SDD
operation: Freq
keyword: #pfreq=noraman
keyword: PBEPBE/SDD
title: #p freq=noraman PBEPBE/SDD
converged: YES YES NO NO
title: Mulliken charges:
elementType: O C C C C C C C C C C H H H H H H H H H H H H H H H H
charge: -0.191756 0.346465 -0.173523 -0.103305 -0.179115 -0.550682 -0.527278 -0.467051 -0.818425 -0.777690 -0.143344 0.236544 0.223180 0.249434 0.228969 0.233506 0.229383 0.243817 0.219902 0.227474 0.213454 0.224490 0.218569 0.231486 0.217016 0.219322 0.169156
chargesum: 0.00000
title: Mulliken charges with hydrogens summed into heavy atoms:
elementType: O C C C C C C C C C C
charge: -0.191756 0.346465 0.063021 0.119875 0.070319 -0.088207 -0.054078 -0.019674 -0.161911 -0.109865 0.025812
polarizability: 1.12534186e+02 -1.71641273e+00 1.02754322e+02 2.16411791e+00 -8.39066671e-01 9.00572351e+01
1716.lowfreq: -10.1818 -0.0006 0.0002 0.0008 3.3111 23.7713 57.9500 86.0584 182.9521
frequency: 57.7817 86.0236 182.9478 192.6015 194.9190 240.7318 242.6731 280.2050 308.7367 322.0534 389.5556 410.8933 521.4287 546.3219 567.4614 663.0834 712.1368 735.3358 773.2219 821.6503 829.4334 867.0035 910.5792 922.6920 948.5906 965.1024 971.8313 1001.9108 1023.5967 1041.9626 1060.2483 1067.4744 1091.8458 1118.1465 1134.6944 1151.4371 1168.2892 1182.7486 1202.7482 1230.8076 1245.5773 1261.1517 1261.8093 1286.8043 1302.0878 1313.8350 1321.1576 1354.1037 1384.2867 1391.2023 1396.6058 1464.5238 1470.4640 1472.5218 1477.9961 1485.5275 1490.0353 1495.7993 1632.1410 2855.7047 2954.4632 2968.7456 2971.4581 2980.8346 3000.2762 3008.1086 3013.8532 3051.0667 3056.7208 3057.8931 3062.9153 3066.6811 3070.0242 3077.0773 3081.7148
redmass: 5.0583 3.1652 1.0840 2.3597 1.2444 2.3300 2.0984 2.1555 2.8116 2.5001 2.0542 2.8895 2.6431 3.5936 3.8775 3.1169 3.0062 3.3000 2.2722 1.3923 2.5376 2.1110 1.8577 2.0883 1.7566 2.0528 1.8646 1.9010 1.4331 1.6205 1.6573 1.6908 1.2971 2.0062 2.1122 1.4226 1.7455 1.7147 1.6876 1.4668 1.6222 1.4740 1.8313 1.3944 1.5482 1.7555 1.7484 1.4826 1.2178 1.2298 1.2159 1.0708 1.0564 1.0581 1.0652 1.0545 1.0634 1.0865 7.8463 1.0834 1.0824 1.0460 1.0705 1.0400 1.0594 1.0613 1.0626 1.1031 1.0899 1.0986 1.0985 1.0983 1.1037 1.1027 1.0993
irintensity: 7.4989 1.8150 0.3918 2.0368 0.6706 1.3881 0.0757 1.5807 4.3228 0.6657 0.3545 2.5127 1.0139 2.2598 3.7271 3.7060 5.1562 4.6583 4.5581 1.6666 3.1086 1.3454 5.7733 3.6869 0.4236 1.2307 6.1193 5.3395 8.0478 3.3242 4.2453 17.5604 4.4172 13.4916 0.3346 3.5242 6.4802 13.8937 1.9781 2.7339 4.0661 0.6379 1.4144 7.6402 4.4771 9.2865 3.1790 0.8341 6.6693 9.5941 18.0596 5.6673 8.2577 2.6081 24.6558 0.1206 6.8861 20.4567 138.0511 111.8094 23.4173 27.9784 52.2906 37.0504 36.1613 26.4701 48.2717 4.0179 35.4717 32.9207 41.9148 21.6331 22.7442 64.3709 35.1131
temp: 298.150 k
press: 1.00000 atm
elementType: 8 6 6 6 6 6 6 6 6 6 6 1 1 1 1 1 1 1 1 1 1 1 1 1 1 1 1
symmnumber: 1
zpe: 621616.0 jmol-1
zpe.correction: 0.236761 hartree
zpe.thermalcorrener: 0.247676 hartree
zpe.thermalcorrenthalpy: 0.248620 hartree
zpe.thermalcorrgfe: 0.200842 hartree
zpe.sumelectzpe: -465.002653 hartree
zpe.sumelectthermal: -464.991738 hartree
zpe.sumelectthermalent: -464.990794 hartree
zpe.sumelectthermalfe: -465.038572 hartree
dipole: -2.7919 1.4031 -1.1256
dipole: 3.3212
quadrupole: -78.4726 -66.3564 -66.5487
quadrupole: 3.9296 -2.9690 0.0181
quadrupole: -8.0133 4.1028 3.9105 3.9296 -2.9690 0.0181
hfenergy: -465.239414 hartree
pointgroup: C01 [X(C10H16O1)]
dipole: 1.0980842 0.5393557 0.4590005 debye
polarizability: 112.5057619|1.5950223|102.7154753|2.4853748|0.8608318|90.1245057 unknown
InChI: InChI=1S/C10H16O/c1-7-8-3-4-10(7,2)9(5-8)6-11/h6-9H,3-5H2,1-2H3
charge 0 multiplicity 1
27 atoms
O  -3.039483 -0.19944 -0.420096
C  0.345025 0.797645 -0.032114
C  0.744175 -1.436875 0.346644
C  1.442283 -0.080077 0.678785
C  -0.935531 0.29168 0.768913
C  0.302138 0.157092 -1.459598
C  -0.65806 -1.23163 0.989065
C  0.580038 -1.367053 -1.202196
C  0.544733 2.316674 -0.013415
C  2.887622 0.092986 0.183021
C  -2.235874 0.630816 0.073204
H  1.266778 -2.341369 0.700588
H  1.419485 0.106913 1.772888
H  -0.941641 0.850302 1.730397
H  1.083175 0.610772 -2.096916
H  -0.664768 0.32798 -1.965063
H  -0.644469 -1.476734 2.066304
H  -1.437801 -1.847938 0.50833
H  -0.249945 -2.008223 -1.546764
H  1.496027 -1.702632 -1.721014
H  0.573003 2.709458 1.020931
H  1.495802 2.592941 -0.504891
H  -0.264513 2.844251 -0.552058
H  2.984836 -0.084884 -0.902307
H  3.263831 1.111473 0.392969
H  3.558108 -0.61978 0.69806
H  -2.455172 1.728554 0.005734
