program: Gaussian 09
title: 000282005
version: EM64L-G09RevD.01
frameworkgroup: C1[X(C16H12N2O5)]
method: RPBEPBE
basis: SDD
operation: Freq
keyword: #p
keyword: freq=noraman
keyword: PBEPBE/SDD
title: #p freq=noraman PBEPBE/SDD
converged: YES YES NO NO
title: Mulliken charges:
elementType: O O O O O N N C C C C C C C C C C C C C C C C H H H H H H H H H H H H
charge: -0.189259 -0.205669 -0.252832 -0.432365 -0.246685 -0.236435 -0.387571 -0.531295 0.243317 0.195009 0.187743 0.112449 0.105515 0.174719 0.023628 0.349208 -0.421765 -0.357407 -0.360509 -0.213719 -0.212687 0.111210 -0.788844 0.314534 0.259820 0.279546 0.269243 0.267528 0.336524 0.236340 0.235865 0.255402 0.245443 0.244246 0.389753
chargesum: 0.00000
title: Mulliken charges with hydrogens summed into heavy atoms:
elementType: O O O O O N N C C C C C C C C C C C C C C C C
charge: -0.189259 -0.205669 -0.252832 -0.042612 -0.246685 -0.236435 -0.051046 0.043059 0.243317 0.195009 0.187743 0.112449 0.105515 0.174719 0.023628 0.349208 -0.142219 -0.088163 -0.092981 0.022621 0.023178 0.111210 -0.043753
polarizability: 2.77429768e+02 2.16187545e+01 1.70041216e+02 -1.94633529e+01 -8.73329621e+00 1.77518549e+02
1716.lowfreq: -0.0010 -0.0010 -0.0008 3.8275 4.3903 7.3736 16.7929 31.1360 38.6308
frequency: 16.6180 31.1036 38.6252 54.6269 73.4039 104.5779 115.3906 139.2482 147.0858 159.2573 176.0848 178.4691 213.1898 240.2222 281.4951 287.6727 303.3568 327.6060 344.8585 366.2580 395.4337 411.4730 456.0086 470.1771 486.8314 521.9284 526.5037 550.5171 583.8611 593.1479 615.7794 627.9340 629.5968 658.4807 681.7697 696.5147 709.5444 727.5619 752.0256 772.6452 788.0519 792.0959 801.3658 836.1795 861.9827 882.2340 905.9393 948.6592 957.7743 972.6315 1001.1757 1004.5974 1012.0883 1015.0095 1051.9967 1065.1838 1073.3353 1109.3862 1128.9124 1166.0806 1171.4472 1190.3558 1204.9925 1228.3806 1263.9707 1282.9244 1311.8997 1318.5382 1327.1099 1377.6352 1393.0629 1406.7789 1415.9868 1432.7889 1453.5072 1453.9756 1467.9029 1471.1670 1478.1302 1545.0199 1613.0186 1615.7508 1619.6330 1628.6971 1636.7812 1641.2399 1680.4743 2980.9287 3011.5758 3056.8022 3101.7131 3113.6451 3137.3028 3151.7270 3163.9254 3173.4742 3214.3286 3498.6258 3524.8050
redmass: 7.4399 6.0466 6.1519 10.3212 8.2768 7.4472 1.1952 5.0431 5.6912 3.6873 5.4702 6.5906 4.6962 7.0289 6.6079 3.7158 4.2236 3.8788 7.8789 5.9120 7.3892 3.1903 4.9328 3.8486 5.1965 6.2353 6.5486 6.1483 6.2827 2.8984 3.4201 3.4656 2.0725 4.8054 6.7047 4.9849 2.9551 3.2618 4.3117 1.8809 5.0764 1.9782 3.1892 4.0974 1.4033 6.9517 1.4045 4.5164 4.3507 1.4152 1.9082 1.3438 2.7647 2.0227 1.5156 2.8759 2.7141 2.3217 4.4855 1.2219 2.0347 2.2091 2.8512 2.6258 2.4114 1.5162 2.1146 1.4798 3.7273 1.6080 2.5481 1.2330 6.1857 2.7013 2.5037 2.6365 1.0432 1.1252 1.2623 10.0747 4.9114 7.5519 7.1800 9.5203 7.3736 8.6352 12.0986 1.0390 1.0647 1.0980 1.0972 1.0972 1.0863 1.0906 1.0955 1.1002 1.0930 1.0770 1.0641
irintensity: 1.1725 2.8106 2.5878 0.1554 2.9374 2.3750 0.8882 0.0138 0.4074 2.1596 0.9952 2.1080 0.5363 0.2633 3.1323 1.4889 11.6480 7.0195 7.3377 3.9250 6.4140 1.0218 0.0332 5.0244 32.7796 5.9243 5.0000 5.5062 4.6999 46.8507 62.8577 21.3638 79.1134 0.0627 1.8445 4.7293 63.7306 11.9999 9.3325 100.6571 0.2811 36.4404 10.0138 2.9784 22.8217 0.2186 0.0039 40.7782 86.6267 2.1170 47.7602 0.0566 117.0627 1.9791 12.4090 44.5767 37.3805 185.0520 8.0344 6.1294 6.1504 9.8039 26.4321 7.2720 26.4697 2.6167 39.0161 51.3829 218.3950 102.1916 36.3514 17.0528 16.7417 12.9216 5.9185 6.8428 16.1245 32.4003 10.2134 80.7948 127.2289 25.7574 178.1708 455.1331 80.7671 164.6815 54.8216 26.8849 8.6373 12.5070 24.8270 9.6246 2.0229 6.9741 7.0054 24.4794 4.6751 43.2127 52.5253
temp: 298.150 k
press: 1.00000 atm
elementType: 8 8 8 8 8 7 7 6 6 6 6 6 6 6 6 6 6 6 6 6 6 6 6 1 1 1 1 1 1 1 1 1 1 1 1
symmnumber: 1
zpe: 667525.7 jmol-1
zpe.correction: 0.254247 hartree
zpe.thermalcorrener: 0.273933 hartree
zpe.thermalcorrenthalpy: 0.274877 hartree
zpe.thermalcorrgfe: 0.204278 hartree
zpe.sumelectzpe: -1100.975747 hartree
zpe.sumelectthermal: -1100.956061 hartree
zpe.sumelectthermalent: -1100.955117 hartree
zpe.sumelectthermalfe: -1101.025716 hartree
dipole: 2.7921 -1.6810 -4.3374
dipole: 5.4253
quadrupole: -89.5386 -124.7326 -138.5643
quadrupole: -6.8647 3.8320 5.6361
quadrupole: 28.0733 -7.1208 -20.9525 -6.8647 3.8320 5.6361
hfenergy: -1101.229994 hartree
pointgroup: C01 [X(C16H12N2O5)]
dipole: -1.0655504 -0.2329778 -1.8347625 debye
polarizability: 265.5393801|42.3300947|189.2021025|8.4583566|10.4712646|170.2480506 unknown
InChI: InChI=1S/C16H12N2O5/c1-8-6-11(16(22)23)12(13(19)17-8)7-18-14(20)9-4-2-3-5-10(9)15(18)21/h2-6,17,22H,7H2,1H3
charge 0 multiplicity 1
35 atoms
O  1.797237 1.712085 2.2741
O  0.621845 -1.662071 -0.796499
O  -0.792649 2.313422 0.113994
O  -3.375156 -3.158005 0.268729
O  -1.942066 -2.609074 1.994624
N  0.88867 0.009385 0.87733
N  -2.711155 1.549828 -0.965852
C  -0.411313 -0.125609 1.559275
C  -1.577388 0.056272 0.60146
C  3.012323 0.780239 0.309476
C  2.663627 -0.245087 -0.602485
C  1.884957 0.953188 1.281689
C  1.29782 -0.753246 -0.247703
C  -2.563533 -0.898312 0.316558
C  -1.626249 1.368856 -0.065157
C  -3.688425 0.610885 -1.257412
C  -3.62246 -0.618982 -0.622389
C  4.243804 1.445992 0.225749
C  3.534411 -0.639988 -1.628468
C  5.131971 1.056282 -0.810945
C  4.783133 0.028487 -1.723614
C  -2.556888 -2.252603 0.961679
C  -4.750777 1.006228 -2.253486
H  -0.472214 -1.097117 2.070462
H  -0.421467 0.682028 2.316374
H  -4.365155 -1.385556 -0.838798
H  4.501896 2.237264 0.936436
H  3.254035 -1.435517 -2.325984
H  -2.732264 2.471306 -1.416647
H  6.102076 1.555379 -0.909306
H  5.489597 -0.251597 -2.512509
H  -5.458757 0.178001 -2.409486
H  -4.306844 1.263868 -3.233793
H  -5.325042 1.885212 -1.903644
H  -3.323702 -4.04124 0.724445
