program: Gaussian 09
title: 000281981
version: EM64L-G09RevD.01
frameworkgroup: C1[X(C15H20O3)]
method: RPBEPBE
basis: SDD
operation: Freq
keyword: #pfreq=noraman
keyword: PBEPBE/SDD
title: #p freq=noraman PBEPBE/SDD
converged: YES YES NO NO
title: Mulliken charges:
elementType: O O O C C C C C C C C C C C C C C C H H H H H H H H H H H H H H H H H H H H
charge: -0.230248 -0.446684 -0.207228 -0.158653 -0.168939 -0.431894 -0.577446 0.282979 -0.258498 0.287410 0.491832 -0.158280 0.090294 -0.520739 -0.316568 -0.689096 -0.834668 -0.848120 0.254758 0.229279 0.199983 0.216574 0.208863 0.227322 0.274572 0.196058 0.213965 0.234457 0.232858 0.224338 0.257744 0.226244 0.235732 0.238351 0.221951 0.222249 0.235791 0.343458
chargesum: 0.00000
title: Mulliken charges with hydrogens summed into heavy atoms:
elementType: O O O C C C C C C C C C C C C C C C
charge: -0.230248 -0.103227 -0.207228 0.096105 0.060340 -0.015336 -0.141261 0.282979 0.016074 0.287410 0.491832 0.037778 0.090294 -0.072317 -0.083710 -0.207014 -0.134341 -0.168129
polarizability: 2.17745505e+02 2.05626701e+01 1.64088265e+02 -4.53155757e+00 1.76548051e+00 1.29054468e+02
1716.lowfreq: -10.4205 -6.3637 -0.0010 -0.0005 -0.0005 11.1283 52.5566 59.9568 94.2169
frequency: 52.5388 59.9514 94.2063 104.3384 119.2228 139.9169 148.0604 167.7760 186.3316 196.1321 221.8946 226.4472 251.3723 288.8789 309.2572 317.5577 333.9758 345.7083 369.9801 383.2166 392.8526 412.3070 447.2590 464.8960 514.0628 526.1900 554.7720 564.6066 613.3298 621.1563 663.9121 696.3856 714.7639 771.7983 786.1422 808.3884 813.2071 851.6094 878.9130 888.1201 894.4760 920.3089 936.5971 958.3020 971.8252 975.5828 980.2653 995.9583 1023.9982 1037.8496 1045.3758 1046.4640 1062.1420 1099.9824 1102.1329 1144.3489 1150.9807 1181.0705 1189.5053 1198.9200 1201.9365 1229.2421 1242.6305 1253.1764 1269.8753 1290.2537 1298.2601 1316.7436 1330.0708 1338.2616 1342.0223 1350.5079 1372.8159 1384.0903 1396.5410 1403.1205 1417.9243 1457.0355 1461.0333 1464.1985 1465.6230 1468.6455 1474.0647 1479.8114 1667.3631 1673.7500 1682.2659 1691.9047 2933.5753 2951.1071 2956.0633 2957.8705 2962.0064 2981.4415 2995.1497 3021.7239 3025.7113 3030.5877 3031.6022 3047.3950 3069.6342 3080.0176 3095.8903 3098.5159 3108.8686 3117.6380 3206.4663 3553.3020
redmass: 4.8706 3.9578 3.3367 5.0292 3.3852 1.3698 3.1188 5.4874 1.5398 2.7174 2.2061 2.9949 2.8179 3.1881 2.4402 2.5438 2.2087 1.6561 2.6675 2.7036 3.1763 3.3599 3.2799 3.0521 3.8077 2.6883 3.2193 3.3436 2.9570 4.2454 2.6685 3.0531 2.6666 3.0782 2.1911 2.2295 2.3694 1.7034 2.8905 2.9731 2.1792 2.0092 1.9581 2.0677 1.5870 1.8008 2.3886 1.8143 2.1417 1.6496 1.8391 3.0748 2.4110 2.4827 2.6322 1.6355 2.1611 1.3498 1.4051 1.3493 1.4210 1.5305 1.9134 1.6945 1.2152 1.4815 1.4159 1.2649 1.2824 1.4772 1.3391 1.4538 1.5418 1.5781 1.2235 1.2488 1.1717 1.0762 1.0778 1.0786 1.0660 1.0577 1.0624 1.0769 6.7037 7.2236 9.1489 7.7391 1.0834 1.0680 1.0797 1.0390 1.0417 1.0608 1.0607 1.0879 1.0963 1.0983 1.0944 1.1009 1.0907 1.0978 1.0955 1.0616 1.0899 1.0888 1.1151 1.0658
irintensity: 4.5848 0.3061 0.2433 0.2551 2.8862 0.3299 3.2898 0.0533 0.8804 0.9963 0.4810 0.3419 4.5344 7.7828 2.3345 4.3407 28.6984 83.2666 44.9545 6.2702 13.7449 2.2587 12.0662 20.7232 5.3008 7.6169 8.8028 2.8529 4.6562 4.2833 5.7345 10.1105 4.8394 6.6192 6.4310 8.7644 3.4858 17.1561 102.2166 5.4084 97.5378 41.4222 12.4722 8.4411 61.2790 6.7193 6.3955 10.4114 52.3109 9.0576 86.2873 96.6315 11.7234 6.4062 11.4959 2.2904 7.8428 8.7574 16.5491 6.1752 4.2504 24.4901 41.0225 15.5234 12.4932 26.3982 17.7997 1.0764 16.9270 0.6166 0.7701 8.1536 0.9299 6.2268 20.3648 23.8868 28.4154 1.8473 12.3743 23.8704 6.4842 11.2740 24.5314 0.9428 4.6412 80.9368 216.2415 32.1210 70.1437 29.2666 2.8717 32.8241 32.1955 45.5305 49.1938 15.9090 29.3026 32.2197 19.9091 18.6793 38.9422 20.1703 22.7659 4.8582 27.5124 2.3377 3.8401 6.4324
temp: 298.150 k
press: 1.00000 atm
elementType: 8 8 8 6 6 6 6 6 6 6 6 6 6 6 6 6 6 6 1 1 1 1 1 1 1 1 1 1 1 1 1 1 1 1 1 1 1 1
symmnumber: 1
zpe: 830598.7 jmol-1
zpe.correction: 0.316358 hartree
zpe.thermalcorrener: 0.334212 hartree
zpe.thermalcorrenthalpy: 0.335156 hartree
zpe.thermalcorrgfe: 0.272155 hartree
zpe.sumelectzpe: -807.838675 hartree
zpe.sumelectthermal: -807.820822 hartree
zpe.sumelectthermalent: -807.819877 hartree
zpe.sumelectthermalfe: -807.882879 hartree
dipole: -3.8393 2.9474 3.4294
dipole: 5.9319
quadrupole: -124.6698 -105.9542 -106.9072
quadrupole: 18.7417 2.6135 -3.3188
quadrupole: -12.1594 6.5562 5.6032 18.7417 2.6135 -3.3188
hfenergy: -808.1550337 hartree
pointgroup: C01 [X(C15H20O3)]
dipole: -1.557432 -1.1093469 -1.3380424 debye
polarizability: 215.4117234|-23.1030889|166.3842368|5.7977958|0.5453195|129.0922777 unknown
InChI: InChI=1S/C15H20O3/c1-9-4-6-12-11(3)15(17)18-14(12)8-10(2)13(16)7-5-9/h5,8,12-14,16H,3-4,6-7H2,1-2H3
charge 0 multiplicity 1
38 atoms
O  2.040941 1.622856 0.372553
O  -2.906866 1.548299 1.603437
O  4.29071 1.2170 0.838077
C  1.277936 -0.644591 -0.068765
C  0.92705 0.861333 -0.320915
C  0.688649 -1.658926 -1.073766
C  -0.871546 -1.720813 -1.166647
C  2.794124 -0.598736 0.029022
C  -0.409181 1.206853 0.243244
C  -1.496565 1.601182 -0.475945
C  -1.602229 -1.900399 0.163525
C  -2.879009 1.415373 0.140534
C  3.186229 0.791055 0.455203
C  -3.38853 -0.033427 -0.172961
C  -2.669063 -1.146701 0.57023
C  3.717111 -1.56551 -0.193925
C  -1.499085 2.048248 -1.924006
C  -1.115303 -3.053265 1.030386
H  0.883605 -0.884188 0.942006
H  1.018327 1.102898 -1.395756
H  1.064539 -2.663284 -0.795587
H  1.0918 -1.448518 -2.084599
H  -1.107937 -2.58614 -1.82349
H  -1.243395 -0.823227 -1.688171
H  -0.564606 0.925377 1.292926
H  -3.593856 2.13555 -0.318307
H  -3.337478 -0.177834 -1.268897
H  -4.45888 -0.065657 0.104009
H  -3.088454 -1.368889 1.561029
H  3.442769 -2.577884 -0.509616
H  4.781807 -1.342454 -0.059286
H  -2.041606 1.333846 -2.576634
H  -0.486342 2.180276 -2.336848
H  -2.025411 3.017725 -2.018309
H  -0.061421 -2.928129 1.348028
H  -1.162822 -4.011278 0.474149
H  -1.729555 -3.157423 1.940946
H  -2.514259 2.425002 1.848423
