program: Gaussian 09
title: 000282000
version: EM64L-G09RevD.01
frameworkgroup: C1[X(C18H15ClN2O5)]
method: RPBEPBE
basis: SDD
operation: Freq
keyword: #p
keyword: freq=noraman
keyword: PBEPBE/SDD
title: #p freq=noraman PBEPBE/SDD
converged: YES YES NO NO
title: Mulliken charges:
elementType: Cl O O O O O N N C C C C C C C C C C C C C C C C C C H H H H H H H H H H H H H H H
charge: -0.000684 -0.227359 -0.198648 -0.199182 -0.213069 -0.210789 -0.222157 0.020076 -0.369193 -0.367811 -0.391393 0.180082 0.181413 0.083801 0.083922 -0.326570 -0.352502 -0.352647 -0.210260 -0.210411 0.502216 -0.300230 -0.287888 -0.359573 -0.385453 0.404737 0.245090 0.243777 0.224795 0.222166 0.227901 0.228315 0.223833 0.223968 0.270832 0.270904 0.240812 0.240866 0.266012 0.311697 0.288606
chargesum: 0.00000
title: Mulliken charges with hydrogens summed into heavy atoms:
elementType: Cl O O O O O N N C C C C C C C C C C C C C C C C C C
charge: -0.000684 -0.227359 -0.198648 -0.199182 -0.213069 -0.210789 -0.222157 0.020076 0.119674 0.079150 0.064823 0.180082 0.181413 0.083801 0.083922 0.121232 -0.081671 -0.081743 0.030552 0.030454 0.502216 -0.300230 -0.021876 -0.047876 -0.096847 0.404737
polarizability: 3.62524615e+02 -1.48724453e+01 2.10990423e+02 -2.21565798e+00 -1.33928112e-01 1.78210279e+02
1716.lowfreq: -9.5721 -5.0349 -1.2317 -0.0018 -0.0005 0.0014 2.0861 12.0990 18.3936
frequency: -5.5659 11.9630 18.3789 22.7003 49.6208 59.9945 73.3737 98.1288 100.7287 132.5203 136.6385 137.3296 153.5727 164.5493 173.4140 177.1682 208.2410 230.0609 261.5983 292.7917 311.2598 320.1928 339.9867 342.8842 397.7367 419.0334 437.1957 446.7015 455.5937 499.1220 522.8693 534.6462 540.6795 561.3775 605.0364 631.8546 658.9371 676.8758 686.5395 691.5608 700.3486 717.5069 732.2550 745.6270 762.3351 785.0201 792.8340 797.1139 823.3085 848.1883 851.2327 907.4901 921.2520 924.1051 945.3081 960.1650 972.5966 975.5529 1007.5297 1014.4909 1026.0273 1031.4681 1040.5345 1056.8149 1072.5757 1101.9723 1105.0012 1142.9169 1148.0197 1168.2917 1171.0849 1204.0773 1211.4315 1213.7774 1245.1782 1260.2084 1262.5364 1280.4468 1284.2473 1291.2526 1333.2456 1335.6714 1345.6342 1355.0186 1378.0865 1382.2651 1396.8535 1416.4608 1419.8946 1446.6977 1453.9155 1455.5641 1465.1283 1469.7046 1477.7276 1488.1011 1577.6987 1601.5434 1614.3105 1617.7028 1628.1364 1676.5160 2963.1989 2984.3809 3000.2961 3015.2375 3024.8259 3035.6179 3068.9025 3085.4027 3140.6391 3153.8102 3165.1766 3168.0735 3175.2523 3187.5103 3190.0014
redmass: 8.6821 7.0418 6.6996 5.5905 8.8525 9.3607 3.5745 2.3857 10.9050 3.0892 5.8165 5.0107 3.4003 11.2591 4.3689 9.7921 6.4076 4.3073 3.2795 6.6851 7.6404 7.5578 9.2159 9.9122 3.9232 4.0580 6.0014 3.3122 4.8664 7.4689 7.2167 4.6032 6.6046 4.9429 9.2188 7.9840 4.7947 4.9930 5.5304 9.0895 5.3622 3.1474 4.1912 1.1723 7.7056 4.6863 1.3901 1.6831 1.5748 8.5102 2.8439 1.3902 1.4103 1.5110 7.5047 8.0095 1.3471 1.4126 1.3476 2.1161 2.3626 2.7404 3.9858 3.2193 2.6815 3.1620 3.5090 1.2697 1.4910 1.2084 1.9991 2.9264 6.1027 1.6585 2.6391 1.3784 1.6175 1.2881 1.4525 1.0620 1.7256 1.2288 2.7988 6.9527 1.5143 1.6393 5.2423 5.8807 5.3178 1.2869 2.4615 2.0626 1.5985 1.1212 1.3772 1.1831 8.1727 7.3819 7.6617 8.0933 11.2891 11.7458 1.0553 1.0592 1.0589 1.0583 1.1054 1.1038 1.1060 1.1062 1.0865 1.0906 1.0957 1.0887 1.1004 1.0930 1.0961
irintensity: 0.0005 0.1209 0.1783 1.8805 2.5778 0.1220 0.0515 0.5616 3.4981 1.1372 2.8238 0.1504 6.8836 1.2931 0.7574 3.2064 0.7899 0.1252 2.6463 0.6383 18.1523 0.3313 3.7960 1.5958 1.4879 1.2324 11.9568 4.6391 0.0039 2.0420 9.3123 0.4270 1.9128 2.5324 15.4674 13.0545 0.0186 0.2184 14.1486 43.9494 2.9604 92.1646 7.3059 9.7417 5.4361 0.1005 4.9665 29.0069 28.5445 18.9508 15.6114 0.0333 27.6869 12.7987 6.3860 141.2389 3.3626 2.2065 0.0043 2.2401 69.5068 51.2915 28.6952 4.1584 9.1170 10.0568 28.3303 63.7845 0.6436 10.3305 3.9572 24.9715 530.1192 11.5755 382.6695 0.3962 77.4067 0.8003 0.9725 1.2190 121.9982 12.6150 235.6104 43.3393 29.2803 16.5224 98.1386 7.8955 20.9707 20.5403 11.9426 7.1808 95.9844 5.1447 46.9923 2.2647 15.6413 170.9686 1.6146 109.4918 338.6346 47.8335 22.2115 6.6010 19.3731 34.5808 13.3031 0.0085 28.4385 20.3717 1.5582 4.7204 5.4165 5.6549 20.7555 5.4729 7.7831
temp: 298.150 k
press: 1.00000 atm
elementType: 17 8 8 8 8 8 7 7 6 6 6 6 6 6 6 6 6 6 6 6 6 6 6 6 6 6 1 1 1 1 1 1 1 1 1 1 1 1 1 1 1
symmnumber: 1
zpe: 788214.5 jmol-1
zpe.correction: 0.300215 hartree
zpe.thermalcorrener: 0.322722 hartree
zpe.thermalcorrenthalpy: 0.323666 hartree
zpe.thermalcorrgfe: 0.244492 hartree
zpe.sumelectzpe: -1638.686393 hartree
zpe.sumelectthermal: -1638.663887 hartree
zpe.sumelectthermalent: -1638.662943 hartree
zpe.sumelectthermalfe: -1638.742117 hartree
dipole: 9.5331 -1.5442 -0.0764
dipole: 9.6576
quadrupole: -183.5045 -160.1098 -166.2521
quadrupole: -25.1869 0.8518 0.1732
quadrupole: -13.5490 9.8456 3.7034 -25.1869 0.8518 0.1732
hfenergy: -1638.9866085 hartree
pointgroup: C01 [X(C18H15Cl1N2O5)]
dipole: -3.7281255 0.6127803 -0.4032748 debye
polarizability: 361.3695835|-17.2344698|199.0336571|10.1621555|-16.5089358|191.3220763 unknown
InChI: InChI=1S/C18H15ClN2O5/c19-15-11-12(21(24)25)7-8-16(15)26-10-4-3-9-20-17(22)13-5-1-2-6-14(13)18(20)23/h1-2,5-8,11H,3-4,9-10H2
charge 0 multiplicity 1
41 atoms
Cl 4.769486 -2.512667 1.850132
O  2.613008 -0.982945 0.544439
O  -4.061179 -1.99793 -1.409402
O  -3.784842 1.088128 2.135404
O  7.920408 1.651673 -1.874372
O  8.801803 0.067993 -0.485137
N  -3.627454 -0.596119 0.463318
N  7.801127 0.688401 -1.019294
C  -2.336051 -1.168806 0.864609
C  -1.141313 -0.446415 0.199849
C  0.202397 -1.048072 0.66866
C  -5.607293 -0.175313 -0.690173
C  -5.524125 0.753179 0.377227
C  -4.391036 -1.050773 -0.653074
C  -4.253162 0.499071 1.12937
C  1.38684 -0.341316 0.00956
C  -6.696466 -0.177505 -1.573979
C  -6.526624 1.709257 0.595837
C  -7.716226 0.787187 -1.361985
C  -7.632692 1.716018 -0.293959
C  3.843851 -0.523642 0.116515
C  4.99433 -1.167264 0.662968
C  4.03351 0.531619 -0.817856
C  6.287484 -0.780635 0.30071
C  5.327029 0.932157 -1.193682
C  6.440059 0.273504 -0.631144
H  -2.343271 -2.236265 0.579737
H  -2.262547 -1.089616 1.964317
H  -1.186271 0.629726 0.456508
H  -1.236841 -0.531901 -0.900091
H  0.247427 -2.126169 0.42445
H  0.299129 -0.95755 1.76708
H  1.401531 0.738545 0.260951
H  1.364441 -0.460188 -1.092641
H  -6.751159 -0.899568 -2.394587
H  -6.452083 2.420295 1.424483
H  -8.58198 0.816302 -2.03209
H  -8.435297 2.448144 -0.155355
H  3.169608 1.040516 -1.252334
H  7.171047 -1.269882 0.717638
H  5.489499 1.740926 -1.910303
