program: Gaussian 09
title: 000281966
version: EM64L-G09RevD.01
frameworkgroup: C1[X(C10H16N2O4)]
method: RPBEPBE
basis: SDD
operation: Freq
keyword: #p
keyword: freq=noraman
keyword: PBEPBE/SDD
title: #p freq=noraman PBEPBE/SDD
converged: YES YES NO NO
title: Mulliken charges:
elementType: O O O O N N C C C C C C C C C C H H H H H H H H H H H H H H H H
charge: -0.278426 -0.278458 -0.298569 -0.298546 -0.143182 -0.143120 -0.411279 -0.411280 -0.174493 -0.174490 0.343519 0.343439 -0.252068 -0.252053 -0.665694 -0.665641 0.263887 0.243319 0.263881 0.243326 0.224820 0.224818 0.235506 0.221445 0.235542 0.221449 0.215152 0.224529 0.251526 0.215154 0.224548 0.251440
chargesum: 0.00000
title: Mulliken charges with hydrogens summed into heavy atoms:
elementType: O O O O N N C C C C C C C C C C
charge: -0.278426 -0.278458 -0.298569 -0.298546 -0.143182 -0.143120 0.095927 0.095927 0.050327 0.050329 0.343519 0.343439 0.204882 0.204938 0.025513 0.025501
polarizability: 1.37011133e+02 -2.51451582e-03 1.35729946e+02 7.07730803e+00 -7.16292670e-03 1.27785140e+02
1716.lowfreq: 0.0007 0.0008 0.0010 4.5016 4.7962 10.0728 30.8734 34.6643 53.7314
frequency: 30.8572 34.5761 53.5990 60.0646 82.0810 85.8221 100.6808 103.5690 138.9127 147.2475 208.0878 216.7397 256.9923 306.1183 321.3685 330.7489 331.9533 374.6410 409.6776 423.5083 443.4544 482.6512 529.1391 606.3872 637.0002 650.2570 678.7977 693.2314 731.1750 789.9021 811.0289 822.8524 833.0498 837.6250 909.4137 927.9157 953.7795 960.5757 976.6272 1014.9774 1015.5259 1045.6867 1082.8604 1095.1419 1096.4981 1128.3378 1155.0355 1156.1356 1158.9199 1194.5398 1195.7222 1263.9608 1281.7627 1281.8640 1314.2055 1327.6208 1346.5954 1351.2492 1364.1853 1385.5364 1388.6900 1390.1647 1395.4380 1457.3517 1457.5330 1463.3634 1463.5242 1464.6773 1465.4477 1485.1090 1485.1906 1627.4261 1629.9187 1675.9899 2965.8423 2967.3750 2990.4207 2990.5112 3028.5299 3029.0291 3063.0843 3063.2788 3085.3815 3085.5176 3091.6324 3091.6996 3117.7135 3117.7980 3123.9691 3152.9955
redmass: 3.8594 3.8073 2.9321 2.7906 5.7007 5.2355 5.8129 5.0566 2.5384 3.1115 1.3674 1.2002 1.8033 2.5199 3.5349 4.7836 4.2594 2.4149 4.8081 4.9483 3.9177 5.1465 5.5829 4.8223 2.1445 1.6535 11.3663 11.2370 3.6123 1.5544 1.3038 2.4792 3.6547 3.9251 3.2064 2.5060 1.2833 2.2145 1.8267 2.5589 2.4949 3.3880 3.6669 2.1562 2.1448 4.7271 1.4596 1.6708 1.3356 1.2910 1.3028 4.5261 1.1214 1.1113 1.4654 1.6013 1.4193 1.4815 1.5657 2.2988 1.2838 1.3929 2.7014 1.1042 1.1092 1.0506 1.0524 1.0709 1.0972 1.0531 1.0537 9.7435 9.5531 6.5277 1.0683 1.0683 1.0361 1.0361 1.0595 1.0596 1.0921 1.0922 1.0972 1.0971 1.1032 1.1032 1.1061 1.1061 1.0852 1.1006
irintensity: 0.2673 0.9779 0.6846 0.0037 3.5355 2.9499 1.1335 0.3114 1.9708 0.4574 4.1132 2.0584 6.3794 9.2333 26.3868 7.0729 0.6767 1.7694 0.7706 18.7659 1.2019 2.7552 3.6647 1.5557 15.7770 42.9650 19.3474 6.5546 8.1181 7.7506 0.0015 2.5218 3.9818 5.4065 20.0580 43.3841 0.6166 15.4948 3.6629 34.4377 32.1033 214.4498 88.1852 5.3993 42.0917 135.0473 21.5710 21.2582 9.1345 134.9417 177.2656 47.4653 10.0118 5.6933 48.7570 97.7457 40.5183 15.6641 18.6428 132.0904 100.7227 47.0207 70.1358 43.6143 35.0368 6.8376 19.4681 45.1403 0.1188 13.9589 20.8583 593.8896 23.8408 0.0146 4.4055 66.4692 40.1785 0.5049 1.0070 58.6098 1.7664 3.3735 17.2492 58.6997 1.0186 1.0237 15.7291 44.5158 3.9575 35.8797
temp: 298.150 k
press: 1.00000 atm
elementType: 8 8 8 8 7 7 6 6 6 6 6 6 6 6 6 6 1 1 1 1 1 1 1 1 1 1 1 1 1 1 1 1
symmnumber: 1
zpe: 678061.8 jmol-1
zpe.correction: 0.258260 hartree
zpe.thermalcorrener: 0.275370 hartree
zpe.thermalcorrenthalpy: 0.276315 hartree
zpe.thermalcorrgfe: 0.211709 hartree
zpe.sumelectzpe: -799.782761 hartree
zpe.sumelectthermal: -799.765650 hartree
zpe.sumelectthermalent: -799.764706 hartree
zpe.sumelectthermalfe: -799.829312 hartree
dipole: 0.0007 0.4240 0.0004
dipole: 0.4240
quadrupole: -94.3191 -77.9675 -98.9490
quadrupole: 0.0077 -12.3456 0.0065
quadrupole: -3.9073 12.4444 -8.5371 0.0077 -12.3456 0.0065
hfenergy: -800.0410208 hartree
pointgroup: C01 [X(C10H16N2O4)]
dipole: -0.1668038 0.0008949 -0.0000346 debye
polarizability: 135.730002|0.0172789|140.005217|0.0267633|3.6740695|124.7910004 unknown
InChI: InChI=1S/C10H16N2O4/c1-3-15-9(13)11-7-5-6-8-12(11)10(14)16-4-2/h5-6H,3-4,7-8H2,1-2H3
charge 0 multiplicity 1
32 atoms
O  1.355067 1.386083 -0.775226
O  1.343884 -1.396231 0.775469
O  0.46492 2.635091 1.014106
O  0.445497 -2.639197 -1.013954
N  -0.419646 0.554264 0.430756
N  -0.4235 -0.551355 -0.432057
C  -1.563465 0.633161 1.358472
C  -1.567157 -0.621566 -1.360656
C  -2.845463 0.278291 0.622218
C  -2.846999 -0.256841 -0.625466
C  0.468637 1.614149 0.276325
C  0.45637 -1.618086 -0.27649
C  2.36423 2.463596 -0.996017
C  2.34489 -2.481124 0.997324
C  1.799162 3.570506 -1.890051
C  1.771821 -3.582436 1.893153
H  -1.595553 1.665931 1.747287
H  -1.400144 -0.040743 2.2249
H  -1.606797 -1.654079 -1.749461
H  -1.398008 0.051042 -2.226971
H  -3.786839 0.487049 1.144321
H  -3.789518 -0.458345 -1.148356
H  2.675111 2.86151 -0.01414
H  3.202356 1.931899 -1.474547
H  2.652305 -2.882734 0.01586
H  3.187268 -1.955187 1.47476
H  2.590436 4.310613 -2.113048
H  1.435089 3.156772 -2.846529
H  0.97041 4.094047 -1.384543
H  2.557575 -4.328224 2.116732
H  1.411433 -3.164641 2.849261
H  0.93883 -4.100415 1.388868
