program: Gaussian 09
title: 000281963
version: EM64L-G09RevD.01
frameworkgroup: C1[X(C10H18N2O4)]
method: RPBEPBE
basis: SDD
operation: Freq
keyword: #p
keyword: freq=noraman
keyword: PBEPBE/SDD
title: #p freq=noraman PBEPBE/SDD
converged: NO YES NO NO
title: Mulliken charges:
elementType: O O O O N N C C C C C C C C C C H H H H H H H H H H H H H H H H H H
charge: -0.276223 -0.276163 -0.297892 -0.297852 -0.127348 -0.127272 -0.384626 -0.384657 -0.394666 -0.394674 0.330353 0.330293 -0.251026 -0.250909 -0.666896 -0.666923 0.221130 0.211235 0.221141 0.211257 0.228562 0.261258 0.228511 0.261240 0.221080 0.234894 0.221101 0.234841 0.214743 0.251073 0.224305 0.214749 0.251079 0.224282
chargesum: 0.00000
title: Mulliken charges with hydrogens summed into heavy atoms:
elementType: O O O O N N C C C C C C C C C C
charge: -0.276223 -0.276163 -0.297892 -0.297852 -0.127348 -0.127272 0.047740 0.047740 0.095154 0.095078 0.330353 0.330293 0.204948 0.205033 0.023225 0.023187
polarizability: 1.46425380e+02 2.50281075e-02 1.41317407e+02 -5.45506301e+00 6.49149093e-03 1.19832273e+02
1716.lowfreq: -0.0008 -0.0003 0.0002 5.3904 5.5977 9.9060 31.0019 34.7764 53.5629
frequency: 31.0015 34.6092 53.5419 60.8357 79.8319 86.2900 102.7036 104.0911 141.5195 143.8846 215.1477 218.2923 262.5449 278.5534 309.4976 317.1460 335.8063 360.4783 403.4110 426.5793 430.2824 478.0966 486.4494 553.1209 586.4097 646.8398 677.5324 690.7332 727.3820 791.8054 808.9357 818.7085 821.9025 829.2426 857.7945 872.5821 904.5067 941.0608 986.4678 1007.0200 1037.2128 1047.9302 1079.1631 1094.6395 1096.0410 1113.5824 1136.3369 1155.4179 1156.0022 1160.7224 1176.2334 1242.3868 1250.5019 1256.1546 1281.2879 1281.4364 1325.8435 1336.3067 1340.5234 1342.2736 1347.3736 1352.4237 1387.0817 1387.4341 1390.5781 1393.5223 1455.5319 1456.9531 1458.6254 1460.5733 1463.1934 1463.3445 1465.5020 1469.5105 1485.4413 1485.4991 1626.4456 1629.8715 2988.1136 2989.7342 2989.9330 2990.1755 2997.4673 2997.7450 3028.0503 3028.5523 3050.0697 3061.4219 3084.9108 3085.0496 3091.2266 3091.2673 3103.7275 3103.9813 3117.3270 3117.4028
redmass: 3.7821 3.6074 2.8604 2.6958 6.1340 5.2221 6.4462 4.7570 2.9857 2.5993 1.2197 1.2602 2.3047 2.0039 2.5180 4.1967 3.6683 2.4337 5.1998 3.3369 4.1622 5.4484 2.5979 3.4840 2.6226 3.7200 11.0378 11.1034 3.6569 1.4218 1.3991 2.7947 2.4350 1.5303 2.7248 3.1141 1.5861 2.1943 2.4785 2.3689 3.1822 3.4831 1.7654 2.1509 2.1404 5.8754 2.1229 1.6661 1.7915 1.9303 1.4265 1.5871 1.3573 3.3867 1.1181 1.1110 1.2993 1.4872 1.3848 1.2704 1.3789 1.3871 1.4777 1.2954 2.0521 2.5263 1.1034 1.1092 1.0866 1.0862 1.0480 1.0527 1.0997 1.0911 1.0533 1.0534 9.0509 9.4438 1.0604 1.0551 1.0360 1.0466 1.0668 1.0653 1.0595 1.0597 1.0993 1.1021 1.0972 1.0972 1.1031 1.1031 1.0974 1.0977 1.1060 1.1061
irintensity: 0.2393 1.0437 1.1948 0.0061 3.2357 2.8604 1.6535 0.3769 0.3599 1.7404 2.3058 2.3579 0.5335 4.3420 6.4921 14.4862 18.7916 9.3749 0.7985 2.3443 13.2002 3.6957 1.6470 2.9051 6.0472 3.9379 21.9231 6.9389 8.5050 10.3538 0.0648 0.0272 2.4171 1.9802 33.7040 0.3739 8.3413 13.0948 5.0174 0.0519 276.6024 96.4329 3.7249 6.7800 37.2483 127.9858 38.6014 30.0823 53.5384 9.4153 106.1798 244.8647 65.0472 57.1926 10.7073 4.5586 1.5216 21.9608 0.4867 11.9876 29.4724 10.3491 40.1551 110.4997 134.5286 62.4058 66.9388 39.8678 0.9231 0.2173 14.6994 17.8802 38.2138 5.2714 15.6475 18.2795 590.9033 27.6156 27.4326 22.3184 42.3820 8.9650 57.2240 2.3701 1.1197 60.0631 37.7449 63.6305 18.3072 59.1685 1.1158 1.1139 1.3999 7.7862 14.7287 47.3153
temp: 298.150 k
press: 1.00000 atm
elementType: 8 8 8 8 7 7 6 6 6 6 6 6 6 6 6 6 1 1 1 1 1 1 1 1 1 1 1 1 1 1 1 1 1 1
symmnumber: 1
zpe: 741013.0 jmol-1
zpe.correction: 0.282237 hartree
zpe.thermalcorrener: 0.299605 hartree
zpe.thermalcorrenthalpy: 0.300549 hartree
zpe.thermalcorrgfe: 0.235526 hartree
zpe.sumelectzpe: -800.981608 hartree
zpe.sumelectthermal: -800.964240 hartree
zpe.sumelectthermalent: -800.963296 hartree
zpe.sumelectthermalfe: -801.028318 hartree
dipole: 0.0053 0.8767 0.0016
dipole: 0.8768
quadrupole: -95.0697 -78.9772 -102.1900
quadrupole: 0.0377 12.9625 -0.0293
quadrupole: -2.9908 13.1018 -10.1110 0.0377 12.9625 -0.0293
hfenergy: -801.2638448 hartree
pointgroup: C01 [X(C10H18N2O4)]
dipole: 0.3449403 0.0005061 -0.0010387 debye
polarizability: 141.31768|0.0460821|147.2635183|-0.0138988|-2.599767|118.9938612 unknown
InChI: InChI=1S/C10H18N2O4/c1-3-15-9(13)11-7-5-6-8-12(11)10(14)16-4-2/h3-8H2,1-2H3
charge 0 multiplicity 1
34 atoms
O  -1.349373 -1.364558 0.803651
O  -1.344504 1.367816 -0.80096
O  -0.439623 -2.670928 -0.933784
O  -0.428888 2.672453 0.934743
N  0.43365 -0.566342 -0.416647
N  0.435621 0.563682 0.419684
C  2.902946 -0.617268 -0.47586
C  2.905241 0.609469 0.473648
C  1.60228 -0.669807 -1.31743
C  1.606414 0.664835 1.317913
C  -0.450747 -1.624477 -0.231724
C  -0.446545 1.623907 0.235955
C  -2.358931 -2.436037 1.04645
C  -2.348005 2.444319 -1.046596
C  -1.79871 -3.519815 1.971873
C  -1.780557 3.524185 -1.972179
H  3.776867 -0.582144 -1.152719
H  2.981972 -1.549725 0.116952
H  3.780486 0.572514 1.148698
H  2.985012 1.541756 -0.119335
H  1.565758 0.170289 -2.03758
H  1.509045 -1.616651 -1.871707
H  1.569617 -0.175109 2.038221
H  1.516294 1.611927 1.872284
H  -3.199883 -1.892917 1.506827
H  -2.664747 -2.859663 0.073734
H  -3.191009 1.905137 -1.507853
H  -2.653233 2.870523 -0.074823
H  -2.590754 -4.254352 2.210084
H  -0.967533 -4.055503 1.483355
H  -1.439573 -3.081095 2.919124
H  -2.568352 4.262604 -2.212475
H  -0.947406 4.056059 -1.48285
H  -1.422126 3.082617 -2.918373
