program: Gaussian 09
title: 000282069
version: EM64L-G09RevD.01
frameworkgroup: C1[X(C24H17NO2)]
method: RPBEPBE
basis: SDD
operation: Freq
keyword: #p
keyword: freq=noraman
keyword: PBEPBE/SDD
title: #p freq=noraman PBEPBE/SDD
converged: YES YES NO NO
title: Mulliken charges:
elementType: O O N C C C C C C C C C C C C C C C C C C C C C C C C H H H H H H H H H H H H H H H H H
charge: -0.301687 -0.185095 -0.465051 -0.152927 -0.172151 0.386971 0.503544 0.201476 0.225254 0.127864 0.191441 -0.439651 -0.475745 -0.406732 0.337857 -0.380872 -0.263730 -0.260033 -0.272852 -0.270745 -0.397307 -0.414043 -0.234325 -0.239563 0.254668 -0.247459 -0.752488 0.323580 0.261769 0.221926 0.227842 0.227731 0.227876 0.230980 0.226716 0.229084 0.263523 0.223379 0.226980 0.227060 0.231337 0.249465 0.251313 0.252819
chargesum: 0.00000
title: Mulliken charges with hydrogens summed into heavy atoms:
elementType: O O N C C C C C C C C C C C C C C C C C C C C C C C C
charge: -0.301687 -0.185095 -0.141470 -0.152927 -0.172151 0.386971 0.503544 0.201476 0.225254 0.127864 0.191441 -0.177882 -0.253819 -0.178891 0.337857 -0.153140 -0.035854 -0.029053 -0.046136 -0.041661 -0.133784 -0.190664 -0.007345 -0.012503 0.254668 -0.016122 0.001110
polarizability: 4.56708031e+02 7.72386984e+00 3.43451810e+02 1.00770575e+01 -2.55965617e+01 1.30410626e+02
1716.lowfreq: -0.0008 -0.0005 -0.0004 2.5498 5.0146 6.5202 26.3742 34.2548 44.2046
frequency: 26.2359 34.2482 44.2012 46.1946 50.9383 69.2419 77.6954 92.6033 101.1956 131.5637 154.6580 194.7277 204.4219 240.2860 262.9141 276.9055 284.8628 293.0570 342.3406 385.3504 400.3796 404.2040 420.0756 432.8736 454.8508 469.0486 499.1100 506.3432 545.0089 553.4233 556.1210 572.4487 578.2287 614.3259 615.1423 645.4264 658.4008 665.7745 682.6783 695.2770 700.0813 716.5090 735.7659 740.7591 768.3068 775.6880 781.2716 788.9740 821.8212 834.7046 849.6840 872.2849 919.6921 940.4873 941.4220 954.5870 959.3572 976.0414 983.8964 984.3524 986.8085 989.4659 991.0082 995.6312 996.0003 1031.3544 1038.3469 1046.6054 1048.2119 1082.4530 1082.8728 1119.1580 1143.4233 1153.7344 1172.1472 1175.0208 1178.9674 1183.3496 1194.6584 1239.2611 1252.9864 1282.8598 1298.3430 1313.3386 1317.5389 1350.5242 1373.0793 1379.1152 1383.6112 1391.9596 1422.2074 1422.4928 1442.3379 1447.8498 1450.9216 1452.0965 1453.6817 1474.6794 1482.4043 1521.9227 1543.9286 1555.4527 1579.4576 1581.9243 1591.9525 1616.0456 1622.6125 1626.4838 1691.0798 3006.3011 3095.5908 3113.9767 3117.3378 3127.8291 3128.5968 3134.3649 3141.7364 3143.0250 3143.6396 3151.9610 3154.6269 3160.5003 3167.1669 3168.5691 3172.7867 3606.0459
redmass: 8.4359 5.5196 5.1650 1.9686 2.7515 3.8719 1.7519 4.1177 4.2971 5.6261 5.2156 5.3870 5.5745 5.0676 5.5237 4.5544 4.5472 5.7923 5.2112 5.5538 6.6215 2.8496 4.7418 3.3313 5.3670 3.4199 4.5029 4.8648 3.5114 2.8934 1.2583 4.2018 3.5158 6.7342 6.5809 6.5262 6.5420 5.4003 5.6104 4.1191 1.8141 5.6602 3.2601 2.3083 1.8023 1.8951 2.0835 5.6258 1.4966 7.8123 1.2551 1.4523 1.4429 1.9819 6.1681 1.9358 1.5599 1.5099 2.3493 1.4491 4.0069 1.8088 3.1138 1.5611 3.7229 2.1642 1.6510 2.0665 2.2099 1.6546 2.9884 2.0750 1.9890 3.2569 1.6112 1.1457 1.1346 1.2787 1.1285 2.4544 1.8346 2.0113 1.9953 1.6537 1.6194 3.1056 4.3891 6.7511 1.2417 6.4333 2.8515 3.3453 2.5726 2.6150 2.1183 1.1886 1.0561 2.5719 3.7373 4.3266 5.8952 6.2195 6.4114 7.2875 5.8702 6.0845 6.5492 6.3873 10.6051 1.0378 1.0958 1.0872 1.0868 1.0852 1.0865 1.0878 1.0925 1.0909 1.1014 1.0935 1.0953 1.0959 1.1012 1.0972 1.0979 1.0800
irintensity: 0.1301 0.0934 1.3095 2.7359 0.0554 0.1603 0.9845 1.0469 1.1450 0.6367 1.5270 2.6999 0.1298 2.7388 1.2616 1.2881 1.4689 2.0999 0.6477 1.9998 1.0294 0.1448 1.4176 4.9558 2.0827 0.7119 13.1147 8.1596 0.9204 8.8341 68.9698 6.4836 3.5079 1.9866 1.1410 9.4577 3.2253 5.7734 21.0023 5.3799 41.3800 4.7818 22.8081 68.7668 46.5518 47.0322 38.7570 23.8586 0.2747 57.1630 0.2570 0.7025 5.5034 0.9735 8.1343 0.8083 1.1324 0.5692 27.4693 0.0423 14.9522 0.6922 1.1828 10.7818 35.8161 18.5740 10.3589 4.9725 7.6554 9.5797 12.1505 2.0240 6.2141 355.1072 1.1411 0.1819 1.5938 4.4409 0.9071 10.9653 5.9008 42.0851 10.1983 25.2717 25.2067 2.5079 9.0208 4.6847 68.0274 11.3557 3.8210 25.3954 11.8515 10.7841 19.4885 17.8443 14.2786 14.0839 68.7240 0.8083 23.7402 8.3234 4.6476 3.0598 3.0654 60.6037 5.9829 20.5082 142.7944 2.0160 6.5057 14.0005 12.3124 0.4637 1.1242 4.8875 20.3288 24.4468 7.7543 4.5532 24.2237 24.7195 31.0324 51.7559 25.1250 41.2800
temp: 298.150 k
press: 1.00000 atm
elementType: 8 8 7 6 6 6 6 6 6 6 6 6 6 6 6 6 6 6 6 6 6 6 6 6 6 6 6 1 1 1 1 1 1 1 1 1 1 1 1 1 1 1 1 1
symmnumber: 1
zpe: 892616.9 jmol-1
zpe.correction: 0.339980 hartree
zpe.thermalcorrener: 0.361636 hartree
zpe.thermalcorrenthalpy: 0.362580 hartree
zpe.thermalcorrgfe: 0.287609 hartree
zpe.sumelectzpe: -1128.180526 hartree
zpe.sumelectthermal: -1128.158870 hartree
zpe.sumelectthermalent: -1128.157925 hartree
zpe.sumelectthermalfe: -1128.232897 hartree
dipole: -1.2199 -0.9674 -1.3267
dipole: 2.0455
quadrupole: -130.7559 -126.5036 -169.7404
quadrupole: -1.9524 4.4390 -6.4370
quadrupole: 11.5774 15.8297 -27.4071 -1.9524 4.4390 -6.4370
hfenergy: -1128.5205059 hartree
pointgroup: C01 [X(C24H17N1O2)]
dipole: 0.489505 -0.3756737 0.5166202 debye
polarizability: 457.039782|-5.2876296|342.5933676|8.5510016|28.0959537|130.9373175 unknown
InChI: InChI=1S/C24H17NO2/c1-15(26)27-24-21-19-13-7-5-11-17(19)18-12-6-8-14-20(18)23(21)25-22(24)16-9-3-2-4-10-16/h2-14,25H,1H3
charge 0 multiplicity 1
44 atoms
O  1.484979 1.946571 0.371093
O  1.892411 2.042408 -1.946042
N  0.630482 -1.555004 0.034034
C  -0.526359 0.398359 0.184449
C  -0.651144 -1.00847 0.051467
C  -1.711605 1.232164 0.231513
C  -1.915387 -1.688175 -0.046389
C  -3.002927 0.593495 0.127185
C  -3.106756 -0.873061 -0.012896
C  0.88275 0.66598 0.255435
C  1.595731 -0.544677 0.167143
C  -1.633417 2.647861 0.38929
C  -2.019477 -3.105281 -0.180555
C  -4.161914 1.426161 0.17085
C  3.034049 -0.828858 0.185914
C  -4.362395 -1.543068 -0.117297
C  -2.792145 3.435069 0.431762
C  -3.269919 -3.728182 -0.279994
C  -4.066725 2.818122 0.316754
C  -4.450924 -2.937597 -0.247691
C  3.933565 0.029137 0.881759
C  3.563506 -1.976988 -0.470677
C  5.313607 -0.254759 0.91671
C  4.943953 -2.261995 -0.425341
C  1.983599 2.563132 -0.824083
C  5.827931 -1.402284 0.267444
C  2.624748 3.883293 -0.466626
H  0.84853 -2.548943 0.030855
H  -0.648788 3.111574 0.492738
H  -1.11274 -3.721678 -0.210041
H  -5.158123 0.9816 0.091933
H  -5.290267 -0.964808 -0.097062
H  -2.71645 4.521005 0.554795
H  -3.338346 -4.816364 -0.382943
H  -4.976611 3.427427 0.345984
H  -5.432406 -3.41727 -0.325631
H  3.53728 0.900801 1.412318
H  2.902283 -2.627158 -1.057055
H  5.989603 0.413393 1.462133
H  5.332528 -3.146376 -0.942493
H  6.9006 -1.621879 0.298756
H  1.980149 4.457272 0.219311
H  2.82157 4.460753 -1.381243
H  3.580674 3.6975 0.055937
