program: Gaussian 09
title: 000281960
version: EM64L-G09RevD.01
frameworkgroup: C1[X(C12H18O3)]
method: RPBEPBE
basis: SDD
operation: Freq
keyword: #pfreq=noraman
keyword: PBEPBE/SDD
title: #p freq=noraman PBEPBE/SDD
converged: YES YES NO NO
title: Mulliken charges:
elementType: O O O C C C C C C C C C C C C H H H H H H H H H H H H H H H H H H
charge: -0.293201 -0.173683 -0.248120 0.317695 0.310573 -0.310809 -0.127169 -0.536180 -0.620976 0.099230 -0.804608 -0.771507 -0.766743 0.292206 -0.763939 0.279105 0.294863 0.257893 0.257070 0.260177 0.271618 0.226693 0.216999 0.226687 0.235343 0.220115 0.222895 0.219457 0.240468 0.216672 0.250113 0.253757 0.247305
chargesum: 0.00000
title: Mulliken charges with hydrogens summed into heavy atoms:
elementType: O O O C C C C C C C C C C C C
charge: -0.293201 -0.173683 -0.248120 0.317695 0.310573 -0.031704 0.167694 -0.021217 -0.089181 0.099230 -0.134229 -0.093154 -0.090145 0.292206 -0.012765
polarizability: 1.50112372e+02 1.75140587e+00 1.30149920e+02 -3.36569951e+00 1.53577722e+00 1.13351898e+02
1716.lowfreq: -31.5667 -13.8661 -9.9694 -0.0011 -0.0006 0.0003 2.5676 14.7162 57.4729
frequency: -31.3480 7.1360 57.4619 80.8467 115.6606 157.7629 188.7089 213.5252 213.7872 221.8512 235.4949 250.2223 272.5720 307.3202 316.1761 343.4504 385.6365 441.2742 451.3808 477.7911 516.8658 524.2305 565.2445 571.1098 581.2302 610.3262 635.7275 711.0436 764.4454 803.0644 831.2047 872.0351 913.3805 922.2592 933.6523 943.6288 948.5187 970.5497 991.1861 1000.0593 1000.7709 1028.0683 1045.5423 1074.3940 1086.2380 1119.7077 1141.8548 1153.5727 1174.3390 1187.7971 1191.9951 1203.8394 1220.7408 1238.6838 1255.1696 1271.3133 1291.8631 1319.4201 1345.9548 1384.3804 1387.5751 1395.2600 1405.4086 1430.9730 1456.2000 1458.4893 1462.7614 1470.7793 1473.3062 1478.2371 1483.3431 1491.4931 1494.1720 1644.8797 1671.4781 2977.7056 2978.9284 2983.9982 3007.9395 3016.4847 3023.1505 3049.6617 3061.9165 3066.2964 3069.3318 3074.6421 3075.8369 3082.6287 3084.5291 3092.4359 3093.4687 3095.5936 3139.5669
redmass: 1.1884 4.4891 4.9419 2.8239 4.9270 1.1516 1.8684 1.7547 1.4547 1.4755 2.6021 3.0259 3.0356 2.7245 3.3411 2.3206 2.6209 2.8217 3.1269 3.8801 2.7709 4.3218 4.0646 3.3693 2.7915 4.0875 4.0016 2.7832 2.5376 3.0573 3.3158 3.5068 1.9807 2.1903 2.0236 1.5429 1.5568 3.4775 1.8258 1.9803 1.3570 2.7724 1.6211 1.5698 2.1731 1.7826 1.6279 2.1742 2.1343 2.0590 2.8427 1.8320 2.2358 2.5462 1.7189 2.3078 1.5357 1.9223 1.3278 1.2231 1.2047 1.2243 1.1882 1.0856 1.0666 1.0464 1.0538 1.0518 1.0499 1.0667 1.0562 1.0633 1.0538 10.4095 11.5726 1.0365 1.0364 1.0373 1.0365 1.0614 1.0609 1.0869 1.0992 1.0984 1.0982 1.0996 1.0996 1.0985 1.1022 1.0969 1.0913 1.0972 1.1012
irintensity: 2.8424 2.4181 3.6317 2.0933 1.6911 0.5698 0.4829 0.6788 1.1219 1.1941 2.3532 4.4459 2.1202 1.7401 3.6810 1.1374 1.5288 0.6575 1.0494 2.3989 5.4879 10.1776 2.4026 3.0826 0.3536 3.6722 3.2196 6.5184 2.5627 5.1123 5.2692 16.1591 1.9735 7.7181 7.4830 3.1861 2.2141 98.2912 13.4124 81.7555 1.2962 12.4523 10.1976 7.0563 8.8333 10.7192 19.6021 1.5262 18.1195 154.2050 236.5869 20.9967 14.3076 1.2207 6.8740 5.5627 5.0041 3.2299 5.4823 52.0029 14.8447 20.2166 25.4228 22.0825 12.3697 15.2769 4.7353 10.9354 14.6723 13.2982 2.5673 5.3367 9.1452 211.9641 209.4730 17.8336 25.9400 35.2715 3.1192 13.2477 18.8579 8.4078 1.3006 47.5313 19.7948 22.3213 10.9170 20.3711 25.4546 30.2322 29.0140 6.1605 8.5164
temp: 298.150 k
press: 1.00000 atm
elementType: 8 8 8 6 6 6 6 6 6 6 6 6 6 6 6 1 1 1 1 1 1 1 1 1 1 1 1 1 1 1 1 1 1
symmnumber: 1
zpe: 725307.5 jmol-1
zpe.correction: 0.276255 hartree
zpe.thermalcorrener: 0.291324 hartree
zpe.thermalcorrenthalpy: 0.292268 hartree
zpe.thermalcorrgfe: 0.233352 hartree
zpe.sumelectzpe: -692.586231 hartree
zpe.sumelectthermal: -692.571162 hartree
zpe.sumelectthermalent: -692.570218 hartree
zpe.sumelectthermalfe: -692.629134 hartree
dipole: -0.4752 -1.7813 0.1779
dipole: 1.8522
quadrupole: -90.5116 -104.4363 -85.5960
quadrupole: -17.7606 -2.9880 -1.0249
quadrupole: 3.0030 -10.9217 7.9187 -17.7606 -2.9880 -1.0249
hfenergy: -692.8624862 hartree
pointgroup: C01 [X(C12H18O3)]
dipole: -0.0929951 0.7205835 -0.0559726 debye
polarizability: 147.8011534|-4.4570665|130.7649886|8.1143067|1.1737208|115.0480478 unknown
InChI: InChI=1S/C12H18O3/c1-7(13)15-10-5-8-9(14)6-12(10,4)11(8,2)3/h8,10H,5-6H2,1-4H3
charge 0 multiplicity 1
33 atoms
O  -1.789163 -0.275636 -0.154369
O  1.762929 -2.908044 -0.090603
O  -2.983373 1.737952 -0.088139
C  0.570498 0.509605 -0.613104
C  1.824456 0.624524 0.370217
C  1.497533 -0.726739 1.108468
C  -0.585011 0.381254 0.434678
C  0.006318 -0.522769 1.557479
C  0.771424 -0.911216 -1.226739
C  1.410131 -1.705885 -0.069938
C  0.369836 1.626863 -1.639087
C  1.806257 1.865097 1.2954
C  3.191588 0.602285 -0.354942
C  -2.927974 0.518303 -0.364805
C  -4.051837 -0.305853 -0.955399
H  2.179179 -1.050176 1.908992
H  -0.907007 1.373781 0.792471
H  -0.545927 -1.475236 1.628713
H  -0.040602 -0.033035 2.54471
H  1.44528 -0.896735 -2.102414
H  -0.174821 -1.380502 -1.54706
H  0.226484 2.608317 -1.151674
H  1.236801 1.700921 -2.321184
H  -0.525175 1.435698 -2.25934
H  0.887376 1.963236 1.896695
H  2.658778 1.823066 1.998463
H  1.916437 2.790779 0.700202
H  4.010345 0.590461 0.388513
H  3.33137 -0.277865 -1.006066
H  3.320074 1.508933 -0.975174
H  -4.92884 -0.258176 -0.286701
H  -3.750914 -1.353365 -1.098229
H  -4.356451 0.13106 -1.922336
