program: Gaussian 09
title: 000022379
version: EM64L-G09RevD.01
frameworkgroup: C1[X(C13H19ClN2O)]
method: RPBEPBE
basis: SDD
operation: Freq
keyword: #p
keyword: freq=noraman
keyword: PBEPBE/SDD
title: #p freq=noraman PBEPBE/SDD
converged: YES YES NO NO
title: Mulliken charges:
elementType: Cl O N N C C C C C C C C C C C C C H H H H H H H H H H H H H H H H H H H
charge: -0.065590 -0.247660 -0.298028 -0.459626 -0.367999 -0.347516 -0.342676 -0.470480 -0.689840 0.180408 0.446544 0.373227 -0.303340 -0.399784 -0.816242 -0.247311 -0.226836 0.182476 0.213504 0.198184 0.174753 0.191304 0.191999 0.292925 0.219119 0.208874 0.214600 0.212027 0.209911 0.307927 0.237073 0.221619 0.292645 0.220779 0.258205 0.234824
chargesum: 0.00000
title: Mulliken charges with hydrogens summed into heavy atoms:
elementType: Cl O N N C C C C C C C C C C C C C
charge: -0.065590 -0.247660 -0.005103 -0.151698 0.027981 0.025421 0.040627 -0.042487 -0.053302 0.180408 0.446544 0.373227 -0.303340 -0.162711 -0.081198 0.010894 0.007988
polarizability: 2.29834892e+02 -2.97837477e+00 1.70933660e+02 -1.47397153e+01 3.16636759e+00 1.11441689e+02
1716.lowfreq: -13.7776 -1.6237 -0.0030 -0.0010 0.0008 5.0802 15.9274 28.3117 36.1339
frequency: 15.4865 26.3527 36.0305 65.2096 71.9381 83.1846 98.3745 127.3807 138.2569 148.4163 170.7113 193.3077 206.5479 226.0693 237.0799 255.7658 295.1962 312.9902 321.4982 378.6077 420.1076 445.4083 462.2480 509.9620 512.9692 540.4417 576.7229 614.6457 640.0086 657.4382 711.2708 735.2334 745.3264 773.0820 799.9615 806.1991 857.2743 894.5751 896.1891 933.1283 937.6461 970.6454 984.3383 995.3513 1025.6184 1051.5350 1052.9246 1080.3725 1083.9630 1125.4579 1134.9091 1150.5590 1168.8050 1183.4364 1196.6173 1203.5181 1224.3742 1241.4859 1264.3402 1275.9224 1281.3044 1283.4131 1317.2784 1348.1592 1365.4471 1381.1707 1391.5491 1397.5198 1417.4946 1449.7965 1455.7971 1464.9028 1466.0048 1467.2542 1473.6194 1478.5411 1478.8619 1485.8981 1495.0865 1497.0085 1573.5625 1608.4752 1636.3575 2813.4711 2829.4727 2953.3257 2959.3629 2966.5243 2973.3083 2980.6774 2980.8328 3006.5786 3040.9266 3064.3721 3070.0924 3072.2898 3090.8534 3135.8150 3157.2224 3179.8037 3434.9546 3493.5419
redmass: 4.4726 2.4228 2.6153 4.2424 3.8859 3.9391 3.3401 2.1655 2.9624 3.8546 3.1932 1.3114 3.9956 2.9579 1.1132 5.7108 4.2064 3.1674 4.5460 7.9591 4.3947 3.1773 3.3047 4.2053 3.9036 4.1169 2.8547 1.5647 3.6036 1.5362 3.8302 1.0738 4.3159 1.2793 1.2181 4.3716 4.4851 1.4003 1.7374 1.3396 3.5316 1.3367 1.8962 1.6319 3.1833 1.5387 2.4878 2.2741 1.8054 2.3234 2.1869 1.6318 2.4760 1.4476 2.1462 1.6321 1.4673 2.0587 1.3265 1.1796 1.9485 1.0806 1.3906 1.5850 6.1698 1.5231 1.2431 1.2279 2.1917 1.2586 1.1658 1.1303 2.6315 1.0782 1.0698 1.0470 1.1944 1.0704 1.7409 1.0957 5.7417 6.9620 5.3362 1.0714 1.0715 1.0845 1.0633 1.0636 1.0363 1.0800 1.0367 1.0982 1.1016 1.0970 1.1005 1.0996 1.1001 1.0876 1.0931 1.0980 1.0742 1.0757
irintensity: 0.1109 0.5306 0.6150 0.3061 1.5849 2.7437 1.2282 4.4751 1.7699 1.6038 0.7548 1.5161 4.8806 3.8618 0.1055 4.8232 9.4232 0.1922 1.8271 14.4498 7.5967 3.2645 0.0798 1.7869 2.6707 8.4862 14.9722 86.2594 5.3808 55.2519 46.6028 10.6085 12.6213 62.2887 3.8680 12.8145 25.7230 0.5223 2.6053 11.2407 20.0669 0.5517 2.6655 9.9275 1.8427 8.3355 12.0167 1.1905 11.8597 2.6958 4.8839 8.4763 62.4294 11.1843 0.8935 69.2958 2.3816 31.3284 5.9888 5.0467 57.9906 2.3872 5.6828 6.3541 61.5737 39.4787 7.4622 27.8732 43.3344 144.5830 81.5580 30.1440 18.1326 2.4402 3.7495 18.8050 24.3510 9.3189 240.0462 9.2240 15.5527 13.1457 100.1825 81.2306 137.4610 49.6700 0.3731 44.9176 36.4886 69.1788 21.8002 3.9247 44.9305 9.7346 82.1428 59.4056 18.8030 6.3301 15.0531 7.8257 17.2065 28.7336
temp: 298.150 k
press: 1.00000 atm
elementType: 17 8 7 7 6 6 6 6 6 6 6 6 6 6 6 6 6 1 1 1 1 1 1 1 1 1 1 1 1 1 1 1 1 1 1 1
symmnumber: 1
zpe: 781821.5 jmol-1
zpe.correction: 0.297780 hartree
zpe.thermalcorrener: 0.316607 hartree
zpe.thermalcorrenthalpy: 0.317551 hartree
zpe.thermalcorrgfe: 0.247914 hartree
zpe.sumelectzpe: -1150.275693 hartree
zpe.sumelectthermal: -1150.256866 hartree
zpe.sumelectthermalent: -1150.255922 hartree
zpe.sumelectthermalfe: -1150.325559 hartree
dipole: 0.9319 -0.6218 2.6352
dipole: 2.8635
quadrupole: -94.4604 -108.5021 -111.7442
quadrupole: -3.5561 -4.5664 0.0894
quadrupole: 10.4418 -3.5998 -6.8420 -3.5561 -4.5664 0.0894
hfenergy: -1150.573473 hartree
pointgroup: C01 [X(C13H19Cl1N2O1)]
dipole: -0.3839184 0.4104111 0.9763999 debye
polarizability: 229.8172213|2.7525897|167.9624163|15.2846045|-12.8427423|114.4306029 unknown
InChI: InChI=1S/C13H19ClN2O/c1-3-4-8-15-9-12(17)16-13-10(2)6-5-7-11(13)14/h5-7,15-16H,3-4,8-9H2,1-2H3
charge 0 multiplicity 1
36 atoms
Cl -2.487317 -2.84819 0.630601
O  0.192221 0.958974 -0.839958
N  2.581265 -0.113214 0.095429
N  -1.011034 -0.226017 0.794992
C  5.029371 -0.024688 -0.317057
C  3.901263 0.043706 0.729909
C  6.43517 0.155838 0.298702
C  1.437366 -0.068205 1.005116
C  7.56205 0.074716 -0.753534
C  0.160408 0.266764 0.217684
C  -2.338067 -0.063323 0.293296
C  -2.890085 1.217479 -0.020017
C  -3.16689 -1.209022 0.161293
C  -4.218963 1.272826 -0.511959
C  -2.111463 2.495365 0.205707
C  -4.488339 -1.148158 -0.304492
C  -5.010726 0.115098 -0.661817
H  4.864614 0.760017 -1.085924
H  4.965915 -0.997593 -0.841874
H  4.0388 -0.775147 1.466031
H  3.987735 1.003125 1.306245
H  6.596565 -0.620879 1.074091
H  6.48603 1.133215 0.820804
H  2.429965 0.512211 -0.709154
H  1.321417 -1.034673 1.540592
H  1.537716 0.719641 1.800087
H  8.557674 0.206595 -0.291397
H  7.554148 -0.90471 -1.267736
H  7.440859 0.85835 -1.525202
H  -0.889412 -0.971151 1.488336
H  -4.641592 2.252368 -0.761341
H  -1.576101 2.47199 1.173083
H  -1.343596 2.629035 -0.577239
H  -2.786901 3.367265 0.202805
H  -5.08537 -2.05951 -0.394007
H  -6.035795 0.190003 -1.038596
