program: Gaussian 09
title: 000281946
version: EM64L-G09RevD.01
frameworkgroup: C1[X(C12H14O3)]
method: RPBEPBE
basis: SDD
operation: Freq
keyword: #pfreq=noraman
keyword: PBEPBE/SDD
title: #p freq=noraman PBEPBE/SDD
converged: YES YES NO NO
title: Mulliken charges:
elementType: O O O C C C C C C C C C C C C H H H H H H H H H H H H H H
charge: -0.188370 -0.170848 -0.170847 0.129288 0.129293 -0.233395 -0.233396 -0.479175 -0.479168 -0.229372 -0.229369 0.159444 0.159446 -0.747160 -0.747158 0.258275 0.258275 0.237189 0.226199 0.226198 0.237187 0.246090 0.246090 0.225023 0.248706 0.223914 0.223915 0.248704 0.225022
chargesum: 0.00000
title: Mulliken charges with hydrogens summed into heavy atoms:
elementType: O O O C C C C C C C C C C C C
charge: -0.188370 -0.170848 -0.170847 0.129288 0.129293 0.024880 0.024880 -0.015786 -0.015783 0.016718 0.016721 0.159444 0.159446 -0.049517 -0.049517
polarizability: 1.17000264e+02 9.39343866e-04 1.36934743e+02 2.01209963e+00 -9.37929187e-06 1.11674167e+02
1716.lowfreq: -27.6112 -17.1495 -13.5995 0.0003 0.0007 0.0007 29.1027 134.7166 144.3053
frequency: 27.3749 134.7091 144.2912 162.1617 175.9820 233.9050 243.4822 289.1533 293.5155 299.4841 303.7571 325.2618 361.3795 373.2917 424.2478 489.7321 542.0243 542.6769 580.9891 604.9970 654.3370 663.6866 686.1922 707.4829 726.1199 786.0533 803.2014 815.7743 835.3365 866.9514 884.6567 928.1303 940.0264 943.9491 958.2949 966.2868 1001.5575 1042.7749 1059.6786 1067.1888 1087.5133 1099.1634 1121.2158 1129.0964 1149.0562 1152.5290 1169.8884 1200.5989 1224.8500 1231.4966 1248.8021 1295.0937 1305.9063 1309.2758 1333.3746 1351.5697 1382.9441 1397.0868 1457.7252 1464.5433 1478.4175 1481.5425 1486.2187 1502.2392 1626.1266 1681.9770 1755.5496 2996.7593 3000.6529 3005.3472 3018.7223 3051.4278 3053.4898 3056.0393 3075.9950 3089.2435 3094.5442 3100.8547 3106.0891 3142.8204 3173.5762
redmass: 4.3869 14.4165 3.8081 5.7246 1.0705 2.9022 1.2124 2.8924 2.1959 2.3506 3.2151 4.0063 2.4385 3.9375 4.9249 4.8151 4.9917 3.6611 11.5895 5.4028 5.3896 4.4740 3.1067 5.5333 2.1790 3.7462 1.5363 2.5726 5.3933 2.5058 3.1150 1.9745 1.7958 1.4860 2.5183 2.4537 1.8444 3.3839 2.8072 1.7250 2.8162 3.5485 1.2707 1.5741 2.6436 2.8257 1.2522 3.5786 1.6862 1.1227 1.6280 1.3231 1.3869 1.6602 1.4570 1.7850 1.1863 1.1802 1.0526 1.0589 1.0688 1.0571 1.0638 1.0653 5.9052 12.6495 12.5447 1.0359 1.0357 1.0588 1.0622 1.0884 1.1010 1.0875 1.1039 1.0998 1.0992 1.1001 1.0993 1.0867 1.1053
irintensity: 0.1034 3.2559 0.4429 2.9635 0.0899 4.0961 0.7852 1.9817 0.0532 4.3251 0.2308 3.4434 0.7638 0.0035 3.4642 11.7663 4.5843 1.3351 2.6450 3.8561 0.6323 1.8508 36.5755 3.0055 17.4330 0.2573 10.1149 0.0423 208.0741 10.4042 98.4571 18.4757 27.2796 0.6077 0.3380 2.5731 2.5797 48.0395 0.9721 1.2365 51.9027 6.1822 7.2348 12.0348 74.4690 0.0001 11.2322 36.5345 3.4426 1.9442 0.0008 0.0040 0.2599 0.3751 1.4394 3.2856 17.5340 20.4319 16.8639 1.2958 12.5344 12.4167 0.1389 19.3698 0.6961 396.8063 107.9266 1.8890 26.8587 26.7060 47.6827 37.8298 4.0051 5.0831 46.8082 12.2440 19.1315 10.0240 24.5713 2.3690 16.8373
temp: 298.150 k
press: 1.00000 atm
elementType: 8 8 8 6 6 6 6 6 6 6 6 6 6 6 6 1 1 1 1 1 1 1 1 1 1 1 1 1 1
symmnumber: 1
zpe: 615953.9 jmol-1
zpe.correction: 0.234604 hartree
zpe.thermalcorrener: 0.247566 hartree
zpe.thermalcorrenthalpy: 0.248510 hartree
zpe.thermalcorrgfe: 0.196035 hartree
zpe.sumelectzpe: -690.225260 hartree
zpe.sumelectthermal: -690.212299 hartree
zpe.sumelectthermalent: -690.211354 hartree
zpe.sumelectthermalfe: -690.263829 hartree
dipole: 5.5392 -0.0002 2.5152
dipole: 6.0835
quadrupole: -98.2947 -96.2725 -82.8089
quadrupole: -0.0001 -5.0605 0.0002
quadrupole: -5.8360 -3.8138 9.6498 -0.0001 -5.0605 0.0002
hfenergy: -690.4598647 hartree
pointgroup: C01 [X(C12H14O3)]
dipole: -2.1046768 0.0005372 1.1396389 debye
polarizability: 116.6932187|0.0024975|136.9347414|-2.3642385|-0.0051583|111.9812132 unknown
InChI: InChI=1S/C12H14O3/c1-11-7-3-5-8(6-4-7)12(11,2)10(14)15-9(11)13/h3,5,7-8H,4,6H2,1-2H3
charge 0 multiplicity 1
29 atoms
O  2.114546 -0.000438 -0.648281
O  1.820739 2.304603 -0.504031
O  1.820094 -2.305332 -0.503003
C  0.130914 0.788859 0.549742
C  0.130731 -0.788642 0.550152
C  -1.122303 1.300216 -0.276035
C  -1.122618 -1.300128 -0.27534
C  -2.422967 0.781601 0.420867
C  -2.423137 -0.780823 0.421321
C  -1.072565 0.68061 -1.665275
C  -1.072738 -0.681281 -1.664909
C  1.396692 1.177278 -0.234171
C  1.396416 -1.17777 -0.233559
C  0.21244 1.479407 1.933956
C  0.212116 -1.478489 1.934725
H  -1.098457 2.402943 -0.308739
H  -1.099046 -2.402879 -0.307455
H  -3.29235 1.172849 -0.135869
H  -2.496319 1.182884 1.447488
H  -2.496521 -1.181487 1.44818
H  -3.292634 -1.172206 -0.135143
H  -1.042867 1.298497 -2.567755
H  -1.043197 -1.299657 -2.56706
H  1.122106 1.186142 2.486061
H  0.243093 2.574144 1.796263
H  -0.658494 1.22944 2.561578
H  -0.658733 -1.227971 2.562246
H  0.242483 -2.573304 1.7976
H  1.121876 -1.185167 2.486645
