program: Gaussian 09
title: 000022372
version: EM64L-G09RevD.01
frameworkgroup: C1[X(C15H12NO2)]
method: RPBEPBE
basis: SDD
operation: Freq
keyword: #p
keyword: freq=noraman
keyword: PBEPBE/SDD
title: #p freq=noraman PBEPBE/SDD
converged: YES YES NO NO
title: Mulliken charges:
elementType: O O N C C C C C C C C C C C C C C C H H H H H H H H H H H H
charge: -0.478677 -0.347332 -0.113059 -0.706101 0.339740 0.165515 0.266466 0.180392 -0.596868 -0.393193 -0.442892 0.387760 -0.426468 -0.488442 -0.270720 -0.241125 0.154233 -0.782692 0.227187 0.227267 0.320003 0.212596 0.222547 0.226168 0.291657 0.200904 0.199967 0.236678 0.191185 0.237304
chargesum: -1.00000
title: Mulliken charges with hydrogens summed into heavy atoms:
elementType: O O N C C C C C C C C C C C C C C C
charge: -0.478677 -0.347332 -0.113059 -0.251647 0.339740 0.165515 0.266466 0.180392 -0.276864 -0.180598 -0.220345 0.387760 -0.200300 -0.196785 -0.069817 -0.041158 0.154233 -0.117525
polarizability: 4.93779218e+02 -3.51202567e-01 1.86799703e+02 -2.88411550e-02 1.75888687e-02 7.81029714e+01
1716.lowfreq: -2.0633 -0.0010 -0.0004 0.0005 5.9444 7.9955 44.6314 57.2011 86.4918
frequency: 44.6107 57.1862 86.4905 115.9978 138.1289 158.9400 186.7701 203.5940 235.2464 277.8172 301.2154 333.2771 370.6705 388.5836 426.2080 438.5727 480.7296 497.4301 503.3791 543.0150 551.4630 575.0601 589.5644 604.5706 636.4024 677.2274 702.1823 726.8155 733.9776 765.6542 810.3467 831.4869 842.5767 847.1639 895.3150 922.2383 923.4131 953.0367 965.2349 974.4085 985.6513 999.0141 1011.7990 1018.0123 1049.1683 1089.8877 1114.1035 1121.2780 1130.2509 1156.6087 1174.7106 1189.8143 1201.7692 1239.2897 1272.9554 1300.6889 1317.2721 1360.3882 1371.5238 1387.1774 1424.5262 1428.2210 1429.1871 1431.0457 1450.7960 1459.1953 1473.1953 1528.8840 1559.2141 1572.5038 1608.3533 1617.6404 2968.0061 2978.8901 3008.7604 3062.3387 3096.4831 3101.5105 3103.7159 3105.7316 3124.4807 3142.2549 3165.0029 3169.7372
redmass: 4.2288 6.5782 3.7332 5.3339 3.0291 1.5064 2.8653 6.2826 2.1889 4.9518 6.1975 6.2391 5.0035 4.7234 2.8607 2.8915 5.5756 5.0844 3.2036 6.0530 3.5537 4.6763 7.5993 3.7144 6.3187 6.0312 2.8756 1.4815 5.5848 2.7961 4.3107 1.4766 5.6503 1.4292 1.5433 1.3789 2.9146 1.2995 1.4751 1.5907 4.8342 2.0796 1.5860 2.1137 2.3819 1.9938 2.2283 1.1497 1.8034 1.1105 1.8986 2.0824 2.2455 2.2738 1.7978 2.0855 4.0405 1.2832 5.1274 4.0445 1.0541 1.2070 1.2029 2.4437 4.2268 3.3747 4.0086 4.4147 7.9609 6.1821 7.2349 7.5856 1.0602 1.0339 1.0996 1.0954 1.0836 1.0894 1.1025 1.0889 1.0934 1.0998 1.0922 1.0929
irintensity: 0.1050 0.1288 4.5906 0.3491 0.5263 0.0014 4.5904 2.1691 10.9394 4.3739 2.0028 13.4102 0.0323 1.5698 9.8392 1.1924 1.5207 2.8546 0.5058 0.7868 0.0270 2.9896 63.3995 1.5249 5.0711 4.0517 1.3846 83.3988 3.9895 23.0512 19.5283 41.1335 28.2903 0.0747 6.3594 2.5909 48.8648 0.4540 21.7589 8.2206 14.1109 32.1022 3.8432 73.5296 210.3084 1.1634 20.6270 0.1265 26.7792 5.3539 26.9070 6.3453 3.5796 247.7891 111.2355 34.1629 827.2538 117.9698 24.9228 3.9938 10.3466 3.2160 100.0951 85.2199 16.2013 34.7021 12.4021 372.3441 10.2882 1.8094 388.2764 107.3153 31.1160 109.7807 16.5354 23.4247 14.5365 33.5020 29.4107 15.7233 54.8781 78.0675 4.8405 3.4180
temp: 298.150 k
press: 1.00000 atm
elementType: 8 8 7 6 6 6 6 6 6 6 6 6 6 6 6 6 6 6 1 1 1 1 1 1 1 1 1 1 1 1
symmnumber: 1
zpe: 597038.5 jmol-1
zpe.correction: 0.227400 hartree
zpe.thermalcorrener: 0.242036 hartree
zpe.thermalcorrenthalpy: 0.242980 hartree
zpe.thermalcorrgfe: 0.185687 hartree
zpe.sumelectzpe: -782.789968 hartree
zpe.sumelectthermal: -782.775332 hartree
zpe.sumelectthermalent: -782.774387 hartree
zpe.sumelectthermalfe: -782.831681 hartree
dipole: 8.2903 -0.9927 -0.0107
dipole: 8.3495
quadrupole: -165.3099 -116.4646 -112.0062
quadrupole: 1.8367 0.0423 0.0150
quadrupole: -34.0496 14.7956 19.2540 1.8367 0.0423 0.0150
hfenergy: -783.0173675 hartree
pointgroup: C01 [X(C15H12N1O2)]
dipole: -3.2657213 -0.3528047 -0.0381099 debye
polarizability: 493.7451187|-3.1269965|186.0086813|1.1598765|9.4075993|78.9280923 unknown
InChI: InChI=1S/C15H12NO2/c1-10(17)16(18)13-6-7-15-12(9-13)8-11-4-2-3-5-14(11)15/h2-7,9H,8H2,1H3
charge -1 multiplicity 1
30 atoms
O  3.987439 1.566861 0.157255
O  3.677242 -2.016222 -0.159216
N  3.335153 0.341407 0.049239
C  -1.37127 -1.768069 -0.14966
C  -0.297597 -0.682594 -0.050642
C  -0.924947 0.602099 0.058743
C  -2.675246 -0.974463 -0.0858
C  -2.378149 0.426471 0.037148
C  1.09352 -0.832369 -0.058623
C  -0.1118 1.75965 0.163308
C  -4.002708 -1.426246 -0.130409
C  1.911341 0.343734 0.045978
C  -3.441289 1.364177 0.113695
C  1.286451 1.631582 0.156897
C  -5.066722 -0.482738 -0.052929
C  -4.777651 0.900373 0.067917
C  4.131946 -0.814514 -0.04982
C  5.620954 -0.511134 -0.015425
H  -1.295492 -2.502074 0.677831
H  -1.287744 -2.347202 -1.091393
H  1.582616 -1.805004 -0.141213
H  -0.566827 2.75522 0.249788
H  -4.224197 -2.497482 -0.224483
H  -3.231847 2.436649 0.207295
H  1.967659 2.483751 0.233703
H  -6.108534 -0.824334 -0.086681
H  -5.603646 1.621278 0.126767
H  5.890851 0.17497 -0.839274
H  6.176499 -1.461055 -0.09024
H  5.878796 0.032778 0.911745
