program: Gaussian 09
title: 000282037
version: EM64L-G09RevD.01
frameworkgroup: C1[X(C26H22N2O5)]
method: RPBEPBE
basis: SDD
operation: Freq
keyword: #p
keyword: freq=noraman
keyword: PBEPBE/SDD
title: #p freq=noraman PBEPBE/SDD
converged: YES YES NO NO
title: Mulliken charges:
elementType: O O O O O N N C C C C C C C C C C C C C C C C C C C C C C C C C C H H H H H H H H H H H H H H H H H H H H H H
charge: -0.172613 -0.209463 -0.233974 -0.341700 -0.257156 -0.436399 -0.456438 -0.242593 -0.535848 -0.578746 -0.489255 0.143123 0.193280 0.556917 0.178265 -0.449266 -0.372520 -0.405800 -0.341175 0.362072 0.478739 -0.349459 -0.443599 -0.213633 -0.195620 0.242159 -0.250761 0.478511 -0.343512 -0.443049 -0.211709 -0.194528 -0.254300 0.251935 0.262868 0.283735 0.270552 0.249650 0.321876 0.242939 0.226267 0.254485 0.302435 0.353397 0.301570 0.233537 0.229133 0.230029 0.231383 0.334544 0.296646 0.223797 0.228831 0.228998 0.231445
chargesum: 0.00000
title: Mulliken charges with hydrogens summed into heavy atoms:
elementType: O O O O O N N C C C C C C C C C C C C C C C C C C C C C C C C C C
charge: -0.172613 -0.209463 -0.233974 -0.341700 -0.257156 -0.083003 -0.121894 0.009342 0.010756 -0.058543 -0.167379 0.143123 0.193280 0.556917 0.178265 -0.206327 -0.146253 -0.151314 -0.038741 0.362072 0.478739 -0.047890 -0.210061 0.015500 0.034409 0.242159 -0.019378 0.478511 -0.046866 -0.219252 0.017121 0.034470 -0.022855
polarizability: 5.05340480e+02 2.98090006e+01 2.89614966e+02 -1.30080219e+01 2.31722543e+01 2.07910865e+02
1716.lowfreq: -6.4739 -0.9697 -0.0013 -0.0010 0.0013 2.9201 9.1098 12.4031 13.3405
frequency: 9.0001 12.1810 13.1925 18.2032 30.1226 38.0132 49.4578 58.7793 65.1499 71.5083 77.8689 86.0328 92.0141 100.4537 113.4239 170.8566 176.4245 185.3429 193.8384 240.9177 250.0843 252.9900 271.3029 289.3605 340.5886 347.8746 355.0696 373.9575 381.2333 387.2750 407.6198 407.7330 410.2533 430.7119 490.5436 505.6918 507.5300 510.8576 516.8777 542.9021 555.8391 569.4890 593.4046 611.9268 613.1724 624.4863 628.2576 634.7708 643.9185 688.7165 696.0351 696.9028 708.1711 734.0023 735.0382 751.6226 760.1306 767.8248 777.4090 803.0543 815.5227 835.9535 841.4466 841.8519 847.7202 848.5069 858.6665 882.8713 892.8107 908.1709 911.3184 915.5646 921.9163 955.9697 958.5420 973.5473 976.5025 977.2839 985.5457 985.6185 997.3116 999.2857 1007.8775 1024.6335 1027.5909 1028.6811 1087.0845 1090.2871 1090.6585 1113.6030 1117.9178 1138.2903 1145.9311 1164.4902 1167.0818 1174.0247 1174.2190 1182.7097 1190.9041 1191.1292 1200.7974 1213.7849 1231.3344 1235.3086 1241.0130 1260.0554 1262.6938 1265.9332 1269.7911 1303.3302 1321.1961 1323.9415 1326.4961 1339.5092 1385.4824 1385.8642 1390.4516 1416.6666 1423.3598 1429.2580 1433.1572 1435.3020 1486.2470 1486.3682 1490.6256 1516.9090 1535.1527 1586.4536 1595.1771 1602.0043 1605.7426 1614.9814 1616.9081 1619.1187 1629.6081 1641.6580 1681.4492 2966.1433 2997.1845 3000.2282 3028.5962 3057.4423 3073.9163 3115.1285 3119.7808 3121.7306 3130.2865 3134.8498 3134.9619 3147.1146 3148.0269 3167.3100 3167.3433 3168.3833 3192.4700 3194.9705 3206.1168 3413.9098 3543.6659
redmass: 4.9893 5.2494 6.0080 5.0081 4.3048 6.5547 6.1002 7.3376 5.6247 4.7372 5.5069 5.9454 5.1690 5.6183 8.7545 6.6690 5.4680 5.7163 6.3646 5.5881 4.0816 4.2964 5.5237 7.5803 6.9390 7.0906 4.3243 6.3130 6.8044 4.3302 2.9146 2.9136 2.9710 5.3106 3.5335 3.2415 3.1659 3.4608 4.6381 3.8957 3.7966 4.2368 4.7722 6.5165 6.3108 6.8757 5.4333 6.5285 1.6171 2.7648 1.8692 2.1567 9.5033 3.4156 1.8980 2.2727 5.5748 1.6630 1.6031 5.0030 3.2796 1.3152 2.3142 1.2656 1.3035 1.5397 5.9348 3.5480 4.1062 3.8662 2.6914 1.4301 1.4434 7.1442 1.4136 1.3579 1.3590 1.3385 6.2153 6.2009 1.3065 1.3107 2.8517 2.5561 2.2052 2.1323 2.4763 1.9176 1.5778 1.4175 1.4837 2.9467 3.6967 1.7286 1.5700 1.0508 1.0595 3.3946 1.1166 1.1124 1.5483 2.5959 1.7391 1.5225 2.3997 2.1318 1.3311 2.2599 1.4315 1.3634 1.2632 1.3945 1.3972 2.0475 7.2275 7.1915 3.7328 1.5437 1.4902 1.0819 2.3089 2.3173 2.2209 2.3590 2.4367 2.2482 2.0169 7.1269 8.5410 5.2816 6.5443 5.6031 6.0976 6.2711 4.7727 8.9381 9.5785 1.0674 1.0801 1.0634 1.0831 1.0994 1.0942 1.0886 1.0883 1.0904 1.0898 1.0869 1.0872 1.0935 1.0937 1.0999 1.0997 1.0954 1.0952 1.0952 1.0940 1.0781 1.0761
irintensity: 0.7961 0.3782 0.5899 0.4548 1.0020 0.6364 0.8026 0.8131 3.1222 2.7579 5.1577 1.0947 3.3930 1.8183 2.4577 1.4041 4.4554 3.9992 5.7062 13.8059 1.7805 2.4722 2.2854 1.1962 1.2105 7.6827 2.5955 1.2287 15.6154 6.0963 0.0053 0.1129 0.0091 8.4128 1.2519 12.9172 21.9168 47.6917 13.8513 1.9724 13.1476 4.2016 3.6915 1.2828 0.3228 0.1024 14.2415 6.5329 15.7111 22.4734 31.3573 75.7872 7.7325 2.8131 34.3614 0.7394 2.0588 106.4620 136.9714 3.1866 11.8999 14.2430 5.8558 1.7482 3.5544 51.4390 16.0822 63.4094 5.0038 33.4101 5.2844 14.6400 19.1202 264.2084 12.6485 0.0370 0.0934 2.3338 2.4475 0.0128 2.2525 2.9522 38.3993 26.7569 0.9230 0.5011 87.6734 8.8350 59.6862 18.5799 92.4210 295.0789 792.1200 166.7155 10.1772 0.3967 0.2280 63.7309 2.3091 4.3352 156.2454 150.0638 18.7541 42.7799 185.2533 8.1864 4.1208 16.2446 0.6266 68.0243 11.7438 24.3630 53.7926 25.7257 42.4590 58.8659 8.1004 23.0788 11.7321 12.3449 201.3250 58.9662 25.5884 77.0808 494.0584 375.5665 402.1365 5.1897 142.3446 35.4682 91.5468 30.2833 103.5258 0.5651 193.1707 157.8503 231.4747 3.7603 9.2150 11.4333 4.4435 5.9885 5.6006 13.8366 8.8122 18.4747 15.7091 0.3628 0.9522 27.6816 26.2231 35.2613 16.9161 5.0706 6.0308 4.7371 6.1670 65.7131 32.4113
temp: 298.150 k
press: 1.00000 atm
elementType: 8 8 8 8 8 7 7 6 6 6 6 6 6 6 6 6 6 6 6 6 6 6 6 6 6 6 6 6 6 6 6 6 6 1 1 1 1 1 1 1 1 1 1 1 1 1 1 1 1 1 1 1 1 1 1
symmnumber: 1
zpe: 1110488.3 jmol-1
zpe.correction: 0.422963 hartree
zpe.thermalcorrener: 0.451807 hartree
zpe.thermalcorrenthalpy: 0.452751 hartree
zpe.thermalcorrgfe: 0.356560 hartree
zpe.sumelectzpe: -1487.306670 hartree
zpe.sumelectthermal: -1487.277826 hartree
zpe.sumelectthermalent: -1487.276882 hartree
zpe.sumelectthermalfe: -1487.373073 hartree
dipole: 2.0312 -4.1858 1.6559
dipole: 4.9385
quadrupole: -161.9403 -185.8656 -203.9771
quadrupole: 1.5329 -15.0531 11.7909
quadrupole: 21.9874 -1.9379 -20.0495 1.5329 -15.0531 11.7909
hfenergy: -1487.7296329 hartree
pointgroup: C01 [X(C26H22N2O5)]
dipole: -0.7004657 -0.6845076 1.6780499 debye
polarizability: 508.1584629|-4.5961887|207.0679541|18.3804694|23.5099028|287.6398941 unknown
InChI: InChI=1S/C26H22N2O5/c29-22-15-18(16-23(30)24(22)25(31)27-19-7-3-1-4-8-19)17-11-13-21(14-12-17)33-26(32)28-20-9-5-2-6-10-20/h1-14,18,24,27-28H,15-16H2
charge 0 multiplicity 1
55 atoms
O  3.174075 1.826669 -3.882787
O  4.045717 -2.285993 -1.949216
O  4.488217 1.750162 -0.587626
O  -4.029249 0.104241 0.903715
O  -5.338062 -0.537845 -0.98821
N  5.753292 -0.238131 -0.724622
N  -6.249245 -0.038284 1.140266
C  1.409366 0.106623 -1.056606
C  1.66914 1.287124 -2.038172
C  1.838121 -1.238371 -1.718306
C  3.969802 0.104235 -2.372468
C  2.95453 1.150101 -2.847955
C  3.326122 -1.249962 -2.020763
C  -0.041261 0.07808 -0.580459
C  4.760421 0.636125 -1.120948
C  -0.360656 0.377582 0.76814
C  -1.106556 -0.22682 -1.464673
C  -1.695929 0.374578 1.217658
C  -2.452411 -0.239042 -1.040041
C  -2.735074 0.066112 0.312517
C  6.696752 -0.088337 0.335777
C  6.79879 1.091655 1.1188
C  7.564973 -1.184616 0.586731
C  7.769487 1.156043 2.142012
C  8.527338 -1.103321 1.612716
C  -5.238992 -0.198441 0.212552
C  8.635894 0.068777 2.397565
C  -7.648561 -0.220369 0.947111
C  -8.213143 -0.611149 -0.295256
C  -8.491111 0.007802 2.06783
C  -9.612465 -0.767052 -0.396423
C  -9.886107 -0.152611 1.948688
C  -10.457082 -0.541519 0.714369
H  2.049985 0.25909 -0.166296
H  0.831594 1.403691 -2.751383
H  1.735128 2.238202 -1.475751
H  1.595309 -2.106671 -1.081901
H  1.29164 -1.377434 -2.675519
H  4.711788 -0.059374 -3.176833
H  0.4424 0.617799 1.47484
H  -0.897496 -0.46381 -2.51538
H  -1.946417 0.606332 2.257015
H  -3.259625 -0.478419 -1.732619
H  5.761291 -1.143608 -1.216086
H  6.128549 1.930563 0.923337
H  7.483505 -2.096343 -0.018535
H  7.846619 2.068585 2.74349
H  9.191193 -1.954589 1.798303
H  9.384571 0.132178 3.194179
H  -5.9375 0.246541 2.071399
H  -7.563919 -0.785972 -1.155309
H  -8.05518 0.309848 3.028803
H  -10.043687 -1.068423 -1.357515
H  -10.525448 0.026472 2.819969
H  -11.540933 -0.665999 0.621574
