program: Gaussian 09
title: 000281857
version: EM64L-G09RevD.01
frameworkgroup: C1[X(C7H10O2)]
method: RPBEPBE
basis: SDD
operation: Freq
keyword: #pfreq=noraman
keyword: PBEPBE/SDD
title: #p freq=noraman PBEPBE/SDD
converged: YES YES NO NO
title: Mulliken charges:
elementType: O O C C C C C C C H H H H H H H H H H
charge: -0.247366 -0.183810 -0.098802 -0.541940 -0.367316 -0.685393 0.365018 0.167475 -0.762762 0.225772 0.248384 0.254957 0.238625 0.217098 0.222297 0.233252 0.227260 0.245702 0.241549
chargesum: 0.00000
title: Mulliken charges with hydrogens summed into heavy atoms:
elementType: O O C C C C C C C
charge: -0.247366 -0.183810 0.126969 -0.038599 -0.128690 -0.012746 0.365018 0.167475 -0.048251
polarizability: 9.04827923e+01 1.27846174e+00 8.78295526e+01 1.07053332e+00 -4.46852869e+00 5.87251001e+01
1716.lowfreq: -12.2366 0.0005 0.0008 0.0009 6.1691 16.7851 98.5394 107.6047 145.4026
frequency: 98.5343 107.5871 145.4025 174.3226 227.9771 277.3419 336.4201 388.5727 449.0433 470.7537 495.3433 557.6730 580.6144 651.6625 790.8024 801.6250 822.7488 895.3365 920.7739 959.7198 982.2674 1034.8930 1052.9009 1066.7240 1095.1580 1144.5177 1183.8990 1220.4567 1268.4283 1291.7745 1312.7824 1342.6020 1389.5341 1402.8683 1436.6957 1450.7668 1469.1256 1471.9594 1476.9331 1687.4110 1697.6301 2978.0095 2985.7207 2988.8301 3003.8282 3069.5080 3075.6739 3082.9237 3087.8566 3108.3062 3158.1069
redmass: 3.7180 3.3552 3.4402 1.1004 1.0271 2.8886 2.2016 2.8712 3.9690 4.9649 5.1539 3.3190 3.8900 4.2819 2.3676 1.5448 2.9217 2.7548 3.2417 1.8501 1.7310 1.4362 1.5360 2.1509 2.1617 2.0183 3.1478 1.3424 1.8802 1.4397 1.5153 1.4996 1.1977 1.2605 1.0812 1.0439 1.0579 1.0497 1.0518 11.4229 7.8069 1.0353 1.0676 1.0370 1.0825 1.0978 1.1003 1.0999 1.0959 1.0993 1.0928
irintensity: 3.8443 0.1264 3.6331 0.0518 0.0404 0.9637 0.7292 1.6847 1.8138 3.1357 6.6163 1.2272 1.7754 0.4086 35.3982 33.7380 2.8140 43.9236 6.7050 41.2249 5.4595 16.4147 16.2099 144.3853 97.4895 27.1833 12.5201 28.2011 47.4152 2.0426 2.4342 14.2951 14.5856 25.6478 16.7724 14.4831 18.2387 7.9255 10.2190 237.5418 88.7343 28.8344 10.8642 18.1514 25.0572 12.7449 34.4366 26.5990 16.8637 16.8789 10.8101
temp: 298.150 k
press: 1.00000 atm
elementType: 8 8 6 6 6 6 6 6 6 1 1 1 1 1 1 1 1 1 1
symmnumber: 1
zpe: 407749.2 jmol-1
zpe.correction: 0.155303 hartree
zpe.thermalcorrener: 0.164422 hartree
zpe.thermalcorrenthalpy: 0.165366 hartree
zpe.thermalcorrgfe: 0.121514 hartree
zpe.sumelectzpe: -422.487927 hartree
zpe.sumelectthermal: -422.478809 hartree
zpe.sumelectthermalent: -422.477865 hartree
zpe.sumelectthermalfe: -422.521716 hartree
dipole: -0.8612 -4.2298 1.6234
dipole: 4.6118
quadrupole: -49.2906 -61.6355 -53.3440
quadrupole: -3.3659 1.7079 2.2534
quadrupole: 5.4661 -6.8788 1.4127 -3.3659 1.7079 2.2534
hfenergy: -422.6432306 hartree
pointgroup: C01 [X(C7H10O2)]
dipole: 0.6723412 1.5595451 0.6386369 debye
dipolederiv: -1.5128804 -0.7433872 -0.0139101 -0.1184367 -0.579323 -0.0974487 0.1279281 -0.0841002 -0.2508806 -0.8358102 -0.3708653 -0.0438571 -0.4120503 -0.8269443 -0.1422274 -0.1361212 -0.2366 -0.3885703 0.0618449 -0.0698663 0.0068348 0.0063604 0.1487413 -0.0282601 -0.0368341 0.0551517 0.2230437 -0.0327392 0.0097775 0.0446742 0.0501433 -0.1842194 -0.1211326 0.0672118 -0.1610089 -0.0416109 -0.0953214 0.053394 0.0450409 0.0076983 -0.2826978 0.0429838 0.0035954 -0.0288059 -0.3558618 0.0144105 0.0744194 -0.0290037 -0.0034497 0.0463051 0.052384 -0.003493 -0.0029398 -0.0280564 0.8073587 0.2414096 -0.0020437 0.2547875 0.7830631 0.1238561 0.0686657 0.2255599 0.0461773 1.740545 0.7427919 -0.0145215 0.2495206 0.884225 0.3258052 -0.113059 0.3456394 0.4191225 -0.1862243 0.0149834 0.0162151 0.0836124 -0.0306041 -0.0163351 0.034603 -0.0272858 0.0766924 0.0337846 0.034814 0.0141463 0.0230617 -0.0680825 -0.1019906 0.0277556 -0.1103524 -0.0686873 -0.1076913 0.0141055 0.0145749 0.0041523 0.07771 -0.0145941 -0.025808 -0.0001847 0.1137494 0.1097721 0.0239897 -0.07331 0.0160608 0.0205229 0.0441861 -0.0186916 0.0596876 -0.063772 -0.0385803 -0.0660446 -0.0082503 -0.1057155 0.0136561 -0.0281505 -0.0151232 -0.0366558 0.1649727 -0.1802163 0.1151415 -0.0065706 0.0493032 0.0674291 0.0092583 0.0134289 0.0278322 0.062075 0.0454529 -0.132803 0.0330087 -0.0818185 -0.0767879 0.0813205 0.0178452 0.050204 0.0543672 0.0807782 0.0248967 0.0194113 0.0151995 -0.0216976 -0.1293866 -0.0031535 -0.0722825 -0.0255343 -0.010119 -0.0635491 -0.0093669 -0.1379574 -0.0430169 -0.0355645 -0.0297422 -0.0357101 0.1090956 0.0527907 0.0439175 0.0055798 0.0333434 0.0858454 -0.0676064 0.066922 -0.0861491 -0.0700027 0.0528447 0.052875 0.0013479 0.0661849 -0.0141245 0.1029026 -0.0459298 0.1180003 0.0236805 unknown
polarizability: 90.8868657|0.6116454|87.4446993|0.0242683|4.5371998|58.70588 unknown
InChI: InChI=1S/C7H10O2/c1-5-3-6(2)9-7(8)4-5/h3,5H,4H2,1-2H3
charge 0 multiplicity 1
19 atoms
O  0.492515 -1.1439 -0.267558
O  -1.645189 -1.957721 -0.357574
C  -0.583307 1.470577 0.401541
C  -1.306895 0.171604 0.847398
C  0.907762 1.187677 0.315475
C  -1.139205 2.019272 -0.940583
C  1.382321 -0.048588 0.017115
C  -0.897977 -1.04441 0.027622
C  2.809959 -0.491104 -0.125408
H  -0.758356 2.23568 1.182464
H  -2.403543 0.264614 0.784726
H  -1.044183 -0.04614 1.90259
H  1.62278 2.001681 0.46787
H  -2.214392 2.262866 -0.851591
H  -0.601869 2.936683 -1.239854
H  -1.018761 1.278929 -1.752365
H  3.497784 0.348989 0.063396
H  2.996908 -0.88327 -1.141615
H  3.039651 -1.306239 0.585249
