program: Gaussian 09
title: 000281858
version: EM64L-G09RevD.01
frameworkgroup: C1[X(C8H12O2)]
method: RPBEPBE
basis: SDD
operation: Freq
keyword: #pfreq=noraman
keyword: PBEPBE/SDD
title: #p freq=noraman PBEPBE/SDD
converged: YES YES NO NO
title: Mulliken charges:
elementType: O O C C C C C C C C H H H H H H H H H H H H
charge: -0.241119 -0.227620 0.273567 -0.402746 0.420542 -0.631810 -0.702241 -0.686611 0.195744 -0.807765 0.244859 0.253806 0.255509 0.239641 0.239854 0.200990 0.225970 0.240791 0.215909 0.233271 0.233787 0.225671
chargesum: 0.00000
title: Mulliken charges with hydrogens summed into heavy atoms:
elementType: O O C C C C C C C C
charge: -0.241119 -0.227620 0.273567 -0.157887 0.420542 -0.122495 -0.021756 -0.003942 0.195744 -0.115035
polarizability: 1.07393805e+02 8.20393750e+00 9.59562484e+01 1.50947553e+00 8.57764562e-01 6.77201046e+01
1716.lowfreq: -3.6769 0.0007 0.0008 0.0010 5.8075 12.5028 49.8068 85.1193 127.4723
frequency: 49.7438 85.1174 127.4333 182.6702 196.8413 236.5510 271.6719 296.5731 319.4074 348.4461 393.1939 432.0515 470.1102 497.8806 523.2252 551.2603 569.9913 758.1344 820.9754 846.5170 891.5243 922.4382 923.5793 928.3027 957.4461 1000.7093 1014.8968 1045.5898 1115.3251 1135.6698 1180.4882 1198.8389 1222.6397 1250.4819 1301.5955 1352.4667 1376.3037 1393.6590 1395.2304 1433.7294 1452.4539 1459.3182 1459.6327 1468.2395 1472.4671 1480.5195 1653.4480 1706.1284 2963.8998 2966.7937 2986.9883 2995.2446 3038.1311 3046.0899 3086.9948 3087.1656 3093.5604 3096.3256 3108.8774 3123.8675
redmass: 2.4608 5.4216 2.5771 1.0679 1.0340 1.1118 2.1625 3.0056 3.0013 2.9780 2.4783 5.4763 5.1483 2.7483 3.0894 3.8268 4.3200 4.4511 1.4487 3.7035 2.9279 2.0780 2.3556 1.8651 1.7866 1.3217 1.6389 1.5550 2.1093 2.4054 1.6664 2.3057 2.6702 2.1814 1.7840 2.2557 1.2163 1.2145 1.2417 1.0764 1.0494 1.0480 1.0482 1.0584 1.0692 1.0537 11.8761 7.3837 1.0500 1.0544 1.0347 1.0357 1.0968 1.0911 1.0989 1.0992 1.1005 1.0999 1.1009 1.0920
irintensity: 4.6323 0.4041 0.7638 0.0751 0.0412 0.1752 0.1571 1.7015 0.8935 1.6603 7.8389 2.0654 5.9042 4.3094 4.6875 4.0908 2.4477 13.8444 19.9781 11.2262 1.2976 12.6203 34.1466 12.8921 4.1556 3.0366 11.7131 7.5766 95.0336 134.1543 11.3901 64.1392 6.6943 50.2270 9.5482 13.2374 24.2640 20.1540 12.9372 16.0800 4.8026 11.9453 6.1185 17.2857 3.2682 14.8055 313.4239 15.4606 16.9542 23.9181 15.8272 18.1151 19.8834 8.4549 5.0825 31.3297 18.4230 33.0458 26.2104 15.4303
temp: 298.150 k
press: 1.00000 atm
elementType: 8 8 6 6 6 6 6 6 6 6 1 1 1 1 1 1 1 1 1 1 1 1
symmnumber: 1
zpe: 477099.8 jmol-1
zpe.correction: 0.181718 hartree
zpe.thermalcorrener: 0.192552 hartree
zpe.thermalcorrenthalpy: 0.193496 hartree
zpe.thermalcorrgfe: 0.145673 hartree
zpe.sumelectzpe: -461.714670 hartree
zpe.sumelectthermal: -461.703835 hartree
zpe.sumelectthermalent: -461.702891 hartree
zpe.sumelectthermalfe: -461.750714 hartree
dipole: 0.8969 -5.1474 1.2105
dipole: 5.3634
quadrupole: -53.7829 -72.2763 -59.3998
quadrupole: 1.3338 -0.1593 2.7729
quadrupole: 8.0367 -10.4566 2.4199 1.3338 -0.1593 2.7729
hfenergy: -461.8963873 hartree
pointgroup: C01 [X(C8H12O2)]
dipole: -0.3499108 -2.0107819 -0.535636 debye
dipolederiv: -0.9944707 0.7391283 0.0400426 0.3140509 -0.9581765 -0.0506277 -0.0941832 0.0924482 -0.352233 -0.542393 0.0803365 -0.0117275 0.2153929 -1.2339379 -0.0997123 -0.0130175 -0.154736 -0.3629838 0.4867628 -0.1665291 -0.0461326 -0.1805173 0.6685491 0.0584639 -0.0201721 0.0483423 0.4828478 -0.1968399 0.0185257 -0.0093769 0.1304575 -0.0802158 -0.0833997 -0.0543978 -0.046449 -0.3090643 0.249178 -0.0025668 -0.0075998 0.0293238 0.2529291 -0.064595 0.0530477 -0.1054423 -0.0970536 -0.2152535 -0.1575048 -0.1016283 -0.1752191 -0.2015433 -0.0419773 -0.1622119 -0.01044 0.1177239 -0.0673602 0.034392 -0.0582366 0.0139768 0.0123068 0.0094475 -0.0410128 0.0349012 -0.054363 -0.0661106 0.0157546 0.0396587 -0.0467505 -0.0195857 0.0358554 0.029113 -0.0229506 -0.1415225 1.246916 -0.5841491 0.0863421 -0.2906617 1.6114839 0.1894953 0.2128006 0.104259 0.2488714 -0.0960031 -0.0899755 0.0148148 -0.0386628 -0.0240092 0.0096425 0.0135714 0.0229307 0.1023139 0.0712068 0.0045137 -0.0059733 0.0018853 -0.1056902 0.0486248 -0.0247975 0.0496196 0.153909 0.1083323 -0.0045717 0.0039553 0.0180688 0.0433524 0.0164416 -0.0450984 0.0520937 -0.0602047 -0.0338493 0.0459604 0.0514901 0.0450301 0.0353698 -0.0182126 0.0948837 -0.0392115 0.0810738 -0.0840556 -0.0813866 -0.0093138 -0.1218801 0.0360023 0.0131572 0.0205209 0.0328251 0.0906612 0.073922 0.0074547 0.084285 0.0048294 0.1052788 -0.0090254 0.0583863 0.0022614 -0.1094724 0.0656165 0.0488268 -0.0093395 0.0898722 -0.1356336 -0.0330581 -0.0000861 -0.0600912 0.0748756 -0.0222867 0.0597334 -0.118775 0.0499206 0.0707915 0.0602462 -0.0866383 0.040074 -0.0272341 -0.0826884 -0.0966717 0.0422452 -0.1284464 0.040031 0.019661 0.040366 -0.0064297 0.0711306 0.0865023 0.0548275 0.0284995 0.0788257 -0.122025 -0.061813 0.0206296 -0.0435949 0.0744084 -0.0333073 0.0117284 0.0825388 0.0322167 0.0572103 -0.0844461 0.1364169 -0.0462209 -0.0178634 0.0639071 0.0753984 -0.0158636 -0.021966 -0.1419335 0.0342627 0.0033979 0.0457256 0.1010804 -0.0177254 -0.0132251 -0.0799052 -0.0197468 0.0894456 0.0515693 -0.1415184 0.0100853 -0.0669011 unknown
polarizability: 107.3054617|-8.2673039|96.0230367|1.8793583|-0.226423|67.7416597 unknown
InChI: InChI=1S/C8H12O2/c1-6-4-7(9)10-8(2,3)5-6/h5H,4H2,1-3H3
charge 0 multiplicity 1
22 atoms
O  0.942532 0.915493 0.357135
O  -0.401591 2.755147 0.32615
C  1.191879 -0.547187 0.027575
C  -0.080541 -1.363664 0.159777
C  -1.319417 -0.833664 0.002819
C  -1.464661 0.646899 -0.305203
C  2.255911 -0.971778 1.054008
C  1.745185 -0.580098 -1.416375
C  -0.292145 1.525971 0.138607
C  -2.596044 -1.638566 0.1083
H  0.05209 -2.430815 0.376418
H  -1.599783 0.803269 -1.39685
H  -2.370935 1.069808 0.165038
H  3.14189 -0.320078 0.972513
H  1.857583 -0.894079 2.07948
H  2.56655 -2.016591 0.871667
H  0.986028 -0.232413 -2.138741
H  2.634021 0.069911 -1.494974
H  2.033046 -1.610677 -1.691727
H  -3.231682 -1.268996 0.93675
H  -2.391882 -2.708597 0.28328
H  -3.199035 -1.550191 -0.816947
