program: Gaussian 09
title: 000281943
version: EM64L-G09RevD.01
frameworkgroup: C1[X(C18H16O2)]
method: RPBEPBE
basis: SDD
operation: Freq
keyword: #pfreq=noraman
keyword: PBEPBE/SDD
title: #p freq=noraman PBEPBE/SDD
converged: YES YES NO NO
title: Mulliken charges:
elementType: O O C C C C C C C C C C C C C C C C C C H H H H H H H H H H H H H H H H
charge: -0.275248 -0.239241 -0.458268 0.048813 0.051024 0.417230 0.417582 0.273816 -0.397266 -0.396995 -0.406260 -0.405108 -0.232607 -0.232630 -0.233804 -0.234074 -0.262157 -0.241733 -0.241591 -0.667384 0.257085 0.224361 0.224034 0.244524 0.244639 0.228647 0.228494 0.228635 0.228761 0.232814 0.220520 0.231206 0.231162 0.215160 0.224207 0.251651
chargesum: 0.00000
title: Mulliken charges with hydrogens summed into heavy atoms:
elementType: O O C C C C C C C C C C C C C C C C C C
charge: -0.275248 -0.239241 -0.201184 0.048813 0.051024 0.417230 0.417582 0.273816 -0.172904 -0.172961 -0.161736 -0.160469 -0.003960 -0.004136 -0.005169 -0.005312 0.191177 -0.010527 -0.010429 0.023634
polarizability: 3.37537954e+02 3.37611333e+01 2.40265956e+02 9.89310329e+00 -2.40396778e+01 1.07914601e+02
1716.lowfreq: -0.8281 0.0002 0.0007 0.0010 3.3116 4.0913 22.5215 38.4972 41.0907
frequency: 22.4356 38.4920 41.0603 43.8533 48.2988 56.7285 81.0844 99.9341 144.9048 167.1272 189.3987 218.6489 253.0013 270.6029 307.8151 333.0919 370.0468 402.4269 405.0332 413.0623 439.1332 506.2950 534.7486 571.1472 587.3795 612.7133 615.5313 665.5521 694.4882 695.4050 708.8161 729.8485 753.7783 772.5976 782.2821 800.9570 826.2614 847.6043 850.8443 891.6148 916.4931 923.6173 926.7911 979.0500 980.9453 986.9835 987.1940 998.3239 998.8230 1009.2761 1021.4688 1022.9990 1030.6194 1069.1333 1083.0152 1094.2698 1096.0881 1118.3896 1153.1765 1160.8881 1172.9402 1173.4408 1184.0985 1188.4564 1278.6739 1313.5699 1313.7959 1323.7879 1331.7432 1356.4775 1377.8312 1377.9933 1389.7962 1436.9805 1437.2912 1456.5976 1463.5951 1470.9386 1485.7407 1492.5973 1575.7063 1576.8826 1603.0057 1613.0470 1634.9850 1859.3438 2991.0600 3026.2072 3082.6281 3085.8324 3090.3357 3116.1843 3126.9428 3127.4593 3132.7066 3133.8560 3144.3950 3145.6160 3153.4407 3154.5700 3167.8108 3168.3748
redmass: 4.5226 3.8717 4.4061 3.5497 4.7191 4.9365 4.1749 4.5777 4.5683 3.3309 4.7106 1.7348 2.8150 4.0272 3.2431 5.1094 4.4655 3.0588 2.8101 3.4282 4.4126 3.5535 4.7569 5.2239 4.8046 6.5145 6.4423 4.8107 1.7090 1.7694 5.8548 7.4486 5.5030 1.7763 2.1407 1.3621 2.9637 1.2582 1.2579 4.4107 6.3930 1.4723 1.4577 1.3894 1.3893 6.2555 6.1501 1.3303 1.3294 2.8652 2.4024 1.7657 1.4208 2.5771 1.5579 2.4281 2.4194 2.8591 2.1756 2.4966 1.0564 1.0569 1.1090 1.1422 1.1182 1.3963 1.3896 1.3501 3.2525 1.3109 6.5094 6.6037 1.2335 2.3729 2.3606 1.0936 1.0443 2.1203 1.0515 2.7780 5.8210 5.7535 5.9168 6.1327 9.3764 11.7746 1.0360 1.0593 1.0876 1.0977 1.1031 1.1057 1.0847 1.0846 1.0875 1.0874 1.0924 1.0922 1.0970 1.0967 1.1017 1.1016
irintensity: 0.9597 0.3559 0.7604 0.0652 0.2003 0.7777 1.1774 0.9899 0.0342 0.1344 0.3422 4.5690 0.5942 0.4908 7.1466 7.5868 6.0384 0.6924 0.0429 2.7577 6.6041 12.7479 13.5351 1.0000 0.4235 0.7623 0.1774 9.6401 7.9705 78.0334 0.8205 18.1225 6.5687 131.9335 0.6742 4.8714 1.9605 0.0141 0.2968 34.6678 3.8038 0.1487 10.8488 0.0389 0.1543 0.1133 0.1020 0.0084 0.2045 66.8376 0.4258 34.0171 17.9158 17.6924 2.9108 188.8559 15.3597 317.9133 27.4836 7.9968 0.0681 0.0659 1.2333 0.7904 3.1875 4.8830 34.0560 27.5818 9.4198 4.8578 0.3600 0.1837 22.7126 2.3561 20.8888 13.7001 13.0354 4.8611 13.3076 25.1462 1.3956 1.2640 0.7759 7.4518 118.0233 7.7748 21.2707 35.3328 17.6841 38.4737 2.4223 37.3548 8.4191 0.6545 0.0398 0.3420 23.9861 6.6449 11.4720 57.1727 52.8299 8.7948
temp: 298.150 k
press: 1.00000 atm
elementType: 8 8 6 6 6 6 6 6 6 6 6 6 6 6 6 6 6 6 6 6 1 1 1 1 1 1 1 1 1 1 1 1 1 1 1 1
symmnumber: 1
zpe: 748194.3 jmol-1
zpe.correction: 0.284972 hartree
zpe.thermalcorrener: 0.303188 hartree
zpe.thermalcorrenthalpy: 0.304132 hartree
zpe.thermalcorrgfe: 0.235505 hartree
zpe.sumelectzpe: -844.502757 hartree
zpe.sumelectthermal: -844.484541 hartree
zpe.sumelectthermalent: -844.483597 hartree
zpe.sumelectthermalfe: -844.552224 hartree
dipole: -0.0518 -0.4975 -1.0120
dipole: 1.1288
quadrupole: -95.5535 -95.3777 -126.1242
quadrupole: -1.3354 1.7927 -5.4341
quadrupole: 10.1317 10.3074 -20.4391 -1.3354 1.7927 -5.4341
hfenergy: -844.7877292 hartree
pointgroup: C01 [X(C18H16O2)]
dipole: 0.0014624 -0.1845752 -0.4039427 debye
polarizability: 331.3632673|40.6756934|247.2086475|16.7761161|-18.3074414|107.1465959 unknown
InChI: InChI=1S/C18H16O2/c1-2-20-18(19)17-15(13-9-5-3-6-10-13)16(17)14-11-7-4-8-12-14/h3-12,17H,2H2,1H3
charge 0 multiplicity 1
36 atoms
O  -1.382706 3.067443 -0.546129
O  -0.886528 1.89359 1.418027
C  -0.385956 0.922881 -0.794872
C  -0.468285 -0.571098 -0.404446
C  0.751564 -0.026391 -0.353651
C  -1.415435 -1.64896 -0.262592
C  2.174374 -0.053644 -0.121441
C  -0.889815 1.960242 0.166347
C  -0.99898 -2.946435 0.160472
C  2.828095 -1.246719 0.308907
C  -2.793221 -1.427773 -0.550042
C  2.95209 1.122463 -0.325038
C  -1.937106 -3.988451 0.289087
C  4.219217 -1.257699 0.525957
C  -3.727984 -2.474172 -0.419404
C  4.344117 1.105926 -0.106414
C  -1.943581 4.183006 0.27574
C  -3.304763 -3.758141 -0.000143
C  4.983638 -0.082975 0.319116
C  -3.414785 3.922326 0.612671
H  -0.476299 1.218109 -1.849207
H  0.057733 -3.125193 0.387928
H  2.237713 -2.155066 0.472455
H  -3.113878 -0.430435 -0.871737
H  2.449896 2.040216 -0.651124
H  -1.608218 -4.98122 0.615749
H  4.712247 -2.178214 0.85767
H  -4.785208 -2.292522 -0.641643
H  4.932199 2.016566 -0.264395
H  -1.336588 4.283971 1.192913
H  -1.816835 5.069704 -0.366219
H  -4.032038 -4.571083 0.1021
H  6.065747 -0.094851 0.489859
H  -3.835657 4.791591 1.151699
H  -4.007482 3.765731 -0.305395
H  -3.514378 3.035183 1.260395
