program: Gaussian 09
title: 000281862
version: EM64L-G09RevD.01
frameworkgroup: C1[X(C10H14O2)]
method: RPBEPBE
basis: SDD
operation: Freq
keyword: #pfreq=noraman
keyword: PBEPBE/SDD
title: #p freq=noraman PBEPBE/SDD
converged: YES YES NO NO
title: Mulliken charges:
elementType: O O C C C C C C C C C C H H H H H H H H H H H H H H
charge: -0.213925 -0.235058 -0.226053 -0.403129 0.400026 -0.403509 -0.583254 -0.395192 -0.350202 -0.023550 0.134533 -0.818544 0.247946 0.212825 0.195373 0.197214 0.216825 0.225463 0.246263 0.212417 0.205426 0.227198 0.202549 0.222259 0.274862 0.231237
chargesum: 0.00000
title: Mulliken charges with hydrogens summed into heavy atoms:
elementType: O O C C C C C C C C C C
charge: -0.213925 -0.235058 0.021893 0.005068 0.400026 0.010531 -0.111528 0.022650 0.079545 -0.023550 0.134533 -0.090187
polarizability: 1.44780043e+02 -6.70227773e+00 1.09697914e+02 -2.38911745e+00 -5.25736904e-03 7.61920933e+01
1716.lowfreq: -11.5059 -1.5213 -0.0002 0.0003 0.0008 13.9032 61.9981 88.4038 113.5544
frequency: 61.9967 88.3628 113.5177 137.7677 208.8756 252.0750 258.3191 308.7792 342.4227 363.7182 400.3231 418.7322 463.7425 499.7798 512.8921 587.2270 624.7521 682.2766 729.7055 782.6298 818.1625 863.1772 879.4347 909.4389 937.7472 974.5564 985.9488 1026.0736 1035.7317 1051.4879 1073.9257 1087.3003 1097.9606 1121.3384 1134.5039 1149.9944 1205.4766 1216.2307 1239.4421 1259.0254 1269.9145 1286.6527 1318.4389 1328.8405 1341.4836 1353.3452 1354.6204 1374.7379 1395.5728 1449.2423 1461.9173 1465.4210 1467.0381 1469.8999 1476.6986 1490.3253 1621.7739 1632.2076 2936.2360 2940.9656 2966.4118 2974.0769 2981.2763 2982.3018 2984.3263 3031.5550 3039.3587 3048.0861 3055.4124 3060.9594 3090.1861 3108.6379
redmass: 3.0537 2.4184 1.2809 2.6242 2.9691 3.3727 2.5886 1.8654 3.8499 3.9908 3.2348 3.0983 3.9144 3.2043 3.1260 3.2847 4.1068 3.9275 5.4196 2.4587 1.7613 2.0017 1.7495 2.1480 2.1642 1.8616 4.5082 2.4136 1.4400 2.4366 2.3909 1.4591 1.5774 2.2547 1.8828 2.7501 1.7111 1.4479 1.3233 1.2485 1.2545 2.0848 1.3984 1.4076 1.4334 1.5071 1.9832 1.3516 1.2217 1.0808 1.0881 1.0754 1.0762 1.0935 1.0883 1.0515 10.8771 9.2706 1.0739 1.0757 1.0626 1.0631 1.0615 1.0398 1.0649 1.0988 1.0983 1.1009 1.0941 1.0963 1.0994 1.0969
irintensity: 1.0774 2.4022 0.9224 0.4813 3.9790 0.7608 0.1560 0.5299 8.7912 2.3863 0.2811 0.8158 2.2812 1.1385 3.2492 1.9534 10.7584 2.3668 14.3784 2.1647 7.7130 9.0344 2.5244 0.8611 3.7264 18.3192 38.9228 17.7196 2.6782 135.3413 8.8493 1.1915 1.2426 6.6592 12.3175 16.2723 15.2653 4.4882 3.9923 6.1110 4.6126 30.3576 2.7796 3.6231 0.1692 2.1683 6.9424 5.0610 25.9214 14.3152 0.6194 25.0293 7.2893 17.8765 10.4556 11.5529 202.7381 162.1785 6.0292 16.0556 18.9086 33.1427 34.3453 29.9953 60.7722 45.3680 53.8304 52.0737 48.8197 9.8015 29.1595 3.3083
temp: 298.150 k
press: 1.00000 atm
elementType: 8 8 6 6 6 6 6 6 6 6 6 6 1 1 1 1 1 1 1 1 1 1 1 1 1 1
symmnumber: 1
zpe: 578171.8 jmol-1
zpe.correction: 0.220214 hartree
zpe.thermalcorrener: 0.231334 hartree
zpe.thermalcorrenthalpy: 0.232278 hartree
zpe.thermalcorrgfe: 0.183454 hartree
zpe.sumelectzpe: -538.987748 hartree
zpe.sumelectthermal: -538.976629 hartree
zpe.sumelectthermalent: -538.975684 hartree
zpe.sumelectthermalfe: -539.024508 hartree
dipole: 6.4698 0.8473 0.4297
dipole: 6.5391
quadrupole: -89.3167 -67.9360 -70.4395
quadrupole: -4.4922 -2.1353 -0.8687
quadrupole: -13.4193 7.9614 5.4579 -4.4922 -2.1353 -0.8687
hfenergy: -539.2079622 hartree
pointgroup: C01 [X(C10H14O2)]
dipole: 2.5508866 0.2995392 0.1484156 debye
dipolederiv: -0.6897584 0.2094309 -0.0441875 0.3129569 -1.0891597 0.1253467 0.0098138 -0.0197551 -0.2949918 -1.2658126 0.2011148 -0.018468 0.0704229 -0.5950023 0.0278542 -0.0639977 0.021566 -0.3534635 -0.1539216 0.0167911 -0.0053655 -0.0758794 -0.0908764 0.0417556 0.0972599 0.0966002 0.109715 0.1286245 -0.0605945 -0.0050426 -0.0729419 0.0761712 0.0263451 0.0691829 -0.0240769 0.1531458 0.3838786 0.141657 -0.1134692 0.010357 0.1030162 0.0079784 -0.3308159 0.0404996 -0.0466573 0.0394762 0.0043868 0.0058804 0.0238949 0.0369703 -0.0052068 -0.0554007 0.006025 0.1529491 -0.1165168 -0.0387085 -0.0029115 -0.0259253 -0.0431492 0.0251586 0.0936724 0.0228451 0.111844 0.1617427 0.023468 -0.0210484 -0.0604578 0.0473025 -0.0093398 0.0405703 0.0019426 0.142147 0.4641347 -0.1983329 0.100339 -0.0266188 0.3422885 -0.0312241 0.0118666 -0.1018372 0.3663835 -0.6441513 -0.2366473 0.028177 -0.3345569 0.047348 0.0743288 0.1213056 0.0056318 -0.094218 1.646753 -0.1790184 0.0131897 -0.008818 1.3429431 -0.1379859 0.0269604 0.0092504 0.2603035 0.0018608 -0.0136213 0.0034884 0.0822987 -0.1468307 -0.0265539 0.0117285 -0.0120139 0.0843028 0.0503142 0.0071673 0.0254095 0.0817276 0.0048391 -0.0217393 0.0217785 -0.0327495 -0.1276928 0.0132659 0.0393859 -0.0013916 0.0790478 -0.1899029 -0.0394423 0.0116728 -0.0657245 0.0655078 0.0287586 -0.0145721 0.0458137 -0.0160499 0.0795897 -0.0230937 -0.0098572 0.0390421 -0.1709662 0.0888859 -0.016413 -0.0036138 -0.0238152 0.0250373 -0.0016348 0.0766291 -0.0198982 -0.1847918 -0.197735 0.0622991 -0.064177 0.0585115 0.0305634 0.0208186 -0.0990927 0.0284272 0.050543 -0.0056922 -0.0298063 0.0356892 -0.0585017 0.08752 -0.0016649 0.0249467 0.0355447 -0.1278231 0.0184201 0.0730993 0.0177549 0.0409229 -0.1150864 -0.0357737 -0.01895 -0.0707026 0.0630814 -0.1193037 -0.1204268 0.0246415 -0.1259488 -0.0809747 0.0341722 0.0522343 0.0516086 0.0693718 0.0537777 0.0334047 0.0304748 0.0484246 0.0558807 0.0133955 -0.0359946 -0.0352731 -0.1736212 0.0480014 0.0497172 -0.0064851 0.0366066 -0.1424145 -0.0147921 0.003715 -0.0567596 0.0793085 -0.0198765 0.0554862 -0.0437905 0.0032491 0.0815997 -0.0608824 -0.0436028 0.0536575 -0.1609533 0.0387799 -0.0644975 -0.108724 -0.0028628 0.0006278 -0.0638319 -0.0665147 -0.0893353 -0.0276078 -0.046125 0.0790396 0.0466661 -0.041195 0.1564337 0.0111383 0.0270622 0.004104 0.1101123 0.0922189 -0.0238092 0.0611506 0.0251511 -0.0247343 0.0648735 0.0238272 0.1113812 -0.0559285 unknown
polarizability: 144.5493376|-7.2557788|109.8888381|-2.6539589|-0.5652764|76.2318746 unknown
InChI: InChI=1S/C10H14O2/c1-7-9-5-3-2-4-8(9)6-12-10(7)11/h8H,2-6H2,1H3
charge 0 multiplicity 1
26 atoms
O  -1.783897 -1.569403 -0.058245
O  -3.36341 0.078408 -0.082978
C  0.649512 -1.005276 -0.310114
C  2.051675 -1.334914 0.276929
C  0.259161 0.462995 -0.138517
C  3.126777 -0.319766 -0.16428
C  1.35015 1.498897 -0.350588
C  2.71801 1.104894 0.264556
C  -0.400393 -1.900682 0.35883
C  -1.053718 0.814651 0.080045
C  -2.146944 -0.208174 0.003268
C  -1.528255 2.249579 0.246655
H  0.679621 -1.224461 -1.400647
H  2.335837 -2.362061 -0.023127
H  1.990596 -1.327125 1.385334
H  3.251307 -0.356142 -1.265995
H  4.103418 -0.59052 0.279514
H  1.490291 1.617691 -1.44849
H  1.027751 2.485247 0.024856
H  3.48344 1.841048 -0.045347
H  2.654459 1.148648 1.370297
H  -0.274737 -2.961456 0.088387
H  -0.337374 -1.793882 1.461069
H  -1.016812 2.752855 1.087555
H  -2.612794 2.260223 0.43627
H  -1.344269 2.849129 -0.664639
