program: Gaussian 09
title: 000281991
version: EM64L-G09RevD.01
frameworkgroup: C1[X(C20H24O3)]
method: RPBEPBE
basis: SDD
operation: Freq
keyword: #pfreq=noraman
keyword: PBEPBE/SDD
title: #p freq=noraman PBEPBE/SDD
converged: YES YES NO NO
title: Mulliken charges:
elementType: O O O C C C C C C C C C C C C C C C C C C C C H H H H H H H H H H H H H H H H H H H H H H H H
charge: -0.266369 -0.205056 -0.240899 -0.041126 -0.540515 -0.097606 0.556144 0.011656 -0.450144 0.308574 0.074874 -0.566352 0.217215 -0.727010 -0.502770 -0.804243 -0.754639 -0.720054 -0.088009 0.348857 -0.242093 0.006833 -0.813007 0.251544 0.241261 0.239780 0.249226 0.231750 0.227377 0.221561 0.224533 0.213956 0.215738 0.252940 0.269433 0.205525 0.229716 0.214895 0.219568 0.294612 0.213027 0.189142 0.198295 0.215681 0.224393 0.226858 0.264930
chargesum: 0.00000
title: Mulliken charges with hydrogens summed into heavy atoms:
elementType: O O O C C C C C C C C C C C C C C C C C C C C
charge: -0.266369 -0.205056 -0.240899 -0.041126 -0.047710 0.142174 0.556144 0.011656 -0.200918 0.308574 0.074874 -0.107225 0.217215 -0.066961 -0.287033 -0.076345 -0.090460 -0.023273 0.110286 0.348857 -0.026412 0.006833 -0.096826
polarizability: 2.82089880e+02 1.57594385e+00 2.14088867e+02 9.73199420e+00 1.36580892e+01 1.91696847e+02
1716.lowfreq: -8.2394 -0.0007 -0.0006 -0.0006 1.8602 10.3795 31.1964 60.6357 66.6898
frequency: 31.1471 60.5758 66.6381 82.6706 91.9921 109.0525 132.4780 135.1548 138.9581 156.9617 165.4996 185.5229 190.2267 208.2838 212.8727 219.5115 227.0022 246.9860 253.0759 274.2402 280.2742 288.3140 305.5274 316.5282 321.6654 336.6145 369.7312 378.0486 383.9681 409.5982 460.9057 480.6717 503.1583 512.4904 552.3962 586.4833 592.9505 645.3298 655.6733 664.9328 679.1934 698.3765 710.6547 722.2597 741.8241 798.0499 817.2955 820.9380 831.1486 847.0320 867.0126 886.4792 892.9579 901.9806 930.5740 940.3626 942.5310 951.7060 968.7291 989.4395 995.3155 1017.0722 1038.8701 1041.8807 1043.9262 1048.3169 1065.9705 1068.9217 1093.5609 1115.8738 1147.3314 1151.6690 1155.7526 1172.5818 1182.8254 1192.6531 1209.6015 1224.0441 1259.3445 1274.3094 1277.5067 1295.3395 1298.8598 1319.6128 1322.8976 1364.6108 1371.3762 1381.3889 1387.5641 1389.0421 1397.5435 1402.3200 1414.2956 1447.5209 1449.1505 1451.1536 1452.0376 1461.9902 1469.0117 1470.7048 1475.4215 1476.2210 1477.9167 1479.7118 1493.7004 1536.9021 1587.7899 1595.7445 1622.2047 1644.6303 1646.3910 2954.7694 2971.9417 2974.4406 2975.0203 2976.6096 2977.5921 2995.0883 3005.2580 3055.5414 3057.6171 3058.8662 3060.4172 3065.3520 3070.5678 3071.7801 3073.3037 3076.9746 3077.5703 3086.2032 3087.0546 3093.9163 3103.0419 3133.0842 3135.5935
redmass: 3.4785 3.6911 4.2447 5.8820 3.4763 3.7635 1.4037 3.5244 1.9807 1.3821 2.8993 2.1026 2.6010 2.4882 1.3924 2.8823 1.3228 2.3733 1.7586 2.3079 3.7189 2.9994 3.9408 2.7844 3.2700 2.9756 3.1270 2.9697 2.3894 2.7719 3.3986 3.1847 2.7460 3.9084 5.0617 4.5734 4.1905 4.3087 4.3924 5.6252 5.0199 2.7979 4.1542 4.8454 5.0158 2.7777 3.9287 2.8513 1.7555 2.8358 2.3762 1.8506 1.7086 2.6458 1.7163 1.7059 1.5533 1.9862 2.2847 1.3629 2.1266 1.3588 1.6228 2.0832 1.8322 1.7530 1.9256 3.1729 2.4020 2.0252 2.1547 2.4987 2.7690 2.4561 3.2584 2.1320 2.0688 1.6610 1.3632 1.4963 1.5336 1.4989 2.6203 1.4409 1.7129 3.3188 1.3630 1.2005 1.1996 1.2130 1.2538 1.3784 1.3898 1.1019 1.0881 1.0518 1.1023 1.0751 1.0525 1.0821 1.0452 1.0720 1.0530 1.0558 1.0860 6.2332 7.4695 9.2391 7.5161 7.7672 9.4431 1.0821 1.0355 1.0366 1.0378 1.0354 1.0395 1.0584 1.0625 1.0959 1.0958 1.1022 1.0872 1.0972 1.0986 1.0881 1.0995 1.1006 1.0990 1.1011 1.0999 1.1000 1.0918 1.0967 1.0945
irintensity: 0.5333 1.0141 5.1803 3.5434 2.7601 1.1567 0.8182 2.2209 0.3181 0.3505 1.2911 0.3744 0.1614 2.7740 1.0677 0.9527 1.2631 1.8529 2.2770 3.8622 1.5980 0.8854 8.2500 0.0676 1.3466 1.7227 0.6383 2.3304 3.5757 4.3545 1.2926 5.9963 1.2816 2.2928 4.1971 1.5858 5.9785 3.8635 5.7624 0.4066 2.4275 4.2511 7.3349 2.4096 1.0116 26.9949 2.1327 15.2557 1.9272 2.9983 10.4806 19.5022 11.0281 15.6651 28.5225 4.4172 5.4045 18.6740 16.5262 8.8168 17.4586 2.1962 10.3795 46.8922 18.6287 9.7625 30.6523 18.2851 6.6041 5.4983 5.9442 7.1782 11.1409 20.8057 67.9921 25.6991 10.2114 0.5943 8.0978 0.6754 0.5786 4.5092 4.8683 6.5262 19.0173 71.6329 4.0040 18.9253 11.0166 10.6082 36.5022 24.5961 16.9131 10.1215 19.1908 16.3038 8.1486 11.1568 3.5460 12.8510 11.5662 6.5780 7.0091 4.6783 21.4666 90.9632 1.2776 284.9165 97.0475 9.6526 3.6584 16.6713 25.2445 31.3057 10.2181 64.2440 61.2185 24.9726 13.2795 14.0296 14.6564 3.5225 12.9897 14.7667 41.5152 14.2558 31.9998 27.5460 40.6833 20.2085 12.5387 19.3030 17.3247 2.4833 14.3104
temp: 298.150 k
press: 1.00000 atm
elementType: 8 8 8 6 6 6 6 6 6 6 6 6 6 6 6 6 6 6 6 6 6 6 6 1 1 1 1 1 1 1 1 1 1 1 1 1 1 1 1 1 1 1 1 1 1 1 1
symmnumber: 1
zpe: 1014855.8 jmol-1
zpe.correction: 0.386538 hartree
zpe.thermalcorrener: 0.409757 hartree
zpe.thermalcorrenthalpy: 0.410701 hartree
zpe.thermalcorrgfe: 0.336253 hartree
zpe.sumelectzpe: -1000.428746 hartree
zpe.sumelectthermal: -1000.405527 hartree
zpe.sumelectthermalent: -1000.404583 hartree
zpe.sumelectthermalfe: -1000.479030 hartree
dipole: 0.2004 -2.5439 -4.1736
dipole: 4.8918
quadrupole: -127.7537 -130.2415 -141.4698
quadrupole: -5.7148 6.7987 -6.3507
quadrupole: 5.4013 2.9135 -8.3148 -5.7148 6.7987 -6.3507
hfenergy: -1000.8152837 hartree
pointgroup: C01 [X(C20H24O3)]
dipole: 0.2127363 0.0656185 1.9116724 debye
polarizability: 280.1064257|6.8843797|197.2195785|-14.7515645|15.9310032|210.5495901 unknown
InChI: InChI=1S/C20H24O3/c1-12-8-15-9-13(2)16(21)6-7-19(4,5)11-17-14(3)18(22)20(15,10-12)23-17/h6-9,12H,10-11H2,1-5H3
charge 0 multiplicity 1
47 atoms
O  -0.213124 1.002531 0.86187
O  -1.773085 0.898335 -2.416178
O  1.86224 -1.409072 -1.720181
C  -1.437189 0.64713 0.036885
C  -2.633024 1.484521 0.552924
C  -3.365282 0.589624 1.59636
C  -1.873881 -0.806701 0.294475
C  -1.010063 0.999209 -1.411155
C  -2.944462 -0.797969 1.150236
C  0.769886 1.461985 -0.029839
C  0.370757 1.483579 -1.354059
C  2.057056 1.837025 0.634868
C  3.11589 0.661707 0.83968
C  -4.894856 0.805046 1.633176
C  -1.404381 -2.023541 -0.393955
C  1.157365 1.861589 -2.574095
C  4.083462 1.130452 1.965199
C  3.94772 0.446177 -0.454679
C  2.389022 -0.592012 1.327904
C  -0.189582 -2.381473 -0.920932
C  1.538911 -1.472619 0.712528
C  1.121576 -1.652323 -0.712801
C  -0.057454 -3.60394 -1.815242
H  -3.306421 1.664939 -0.306738
H  -2.298164 2.456762 0.950821
H  -2.95845 0.787275 2.611395
H  -3.465718 -1.704171 1.481977
H  2.560521 2.631929 0.054533
H  1.809281 2.246007 1.632457
H  -5.135682 1.849977 1.902086
H  -5.343947 0.594564 0.645145
H  -5.376585 0.14498 2.378081
H  -2.221348 -2.738227 -0.57898
H  0.488021 2.312574 -3.327518
H  1.605535 0.959129 -3.033537
H  1.973976 2.569916 -2.348615
H  4.880945 0.382256 2.127036
H  3.55123 1.281125 2.923336
H  4.56812 2.085146 1.690154
H  3.322527 0.139233 -1.303886
H  4.696815 -0.351182 -0.295388
H  4.489974 1.378972 -0.703377
H  2.489117 -0.75373 2.413689
H  1.035228 -2.187397 1.379422
H  -1.028117 -4.107275 -1.960946
H  0.664314 -4.335963 -1.404235
H  0.334429 -3.293903 -2.801403
