program: Gaussian 09
title: 000281838
version: EM64L-G09RevD.01
frameworkgroup: C1[X(C14H20)]
method: RPBEPBE
basis: SDD
operation: Freq
keyword: #p
keyword: freq=noraman
keyword: PBEPBE/SDD
title: #p freq=noraman PBEPBE/SDD
converged: YES YES NO NO
title: Mulliken charges:
elementType: C C C C C C C C C C C C C C H H H H H H H H H H H H H H H H H H H H
charge: 0.056501 -0.450588 -0.452900 -0.403177 -0.401038 -0.382583 -0.452224 -0.580198 0.508121 -0.416811 -0.416141 -0.229505 -0.230331 -0.245407 0.184442 0.186755 0.205989 0.197874 0.191840 0.196139 0.189567 0.191236 0.196021 0.198173 0.187422 0.210579 0.211499 0.201669 0.216570 0.230701 0.230839 0.221597 0.221613 0.225757
chargesum: 0.00000
title: Mulliken charges with hydrogens summed into heavy atoms:
elementType: C C C C C C C C C C C C C C
charge: 0.240943 -0.057844 -0.063186 -0.017471 -0.013781 0.003012 -0.030147 -0.161959 0.508121 -0.186110 -0.185302 -0.007908 -0.008718 -0.019649
polarizability: 1.91285519e+02 -6.32493232e+00 1.31101271e+02 -1.07276589e+01 -1.27749800e+01 1.10778146e+02
1716.lowfreq: -6.7368 -0.0003 -0.0002 0.0002 7.5890 15.2055 21.5861 41.7568 56.9013
frequency: 16.9002 40.2427 56.7497 78.8014 129.0127 180.2570 220.6748 228.6660 306.6368 335.6808 342.4620 402.6531 423.0950 425.4226 436.7232 503.7681 527.7799 595.1226 618.0339 705.0955 749.8192 760.3570 784.0147 784.2357 817.2193 842.7720 852.3754 869.0367 890.7972 911.5085 916.1336 960.0699 973.0805 975.9888 989.9019 991.9924 1020.3795 1027.8219 1052.0685 1055.9890 1062.1731 1083.5265 1095.6441 1116.6431 1124.0902 1166.3484 1171.2584 1186.6498 1187.7754 1218.8015 1240.2756 1257.4176 1258.0095 1266.6272 1279.7551 1300.5613 1312.9730 1327.2888 1332.1093 1335.0346 1339.7278 1343.0052 1346.7599 1360.3634 1383.3816 1440.9113 1454.9236 1460.6313 1463.6060 1464.4521 1468.1607 1475.2631 1481.1342 1483.7294 1593.1655 1614.7723 2925.7762 2950.3652 2954.3832 2961.1030 2962.7625 2963.3732 2964.1477 2981.9468 3008.0810 3015.5804 3023.8280 3025.5732 3026.6623 3039.0669 3047.8106 3111.9326 3112.6052 3129.3843 3141.1388 3160.3683
redmass: 3.3704 3.3875 3.6485 2.7912 3.2237 2.5448 2.2605 2.7846 1.9573 2.0653 2.9067 2.8188 3.3416 1.9930 2.7317 2.3521 2.4297 3.1922 6.3571 1.7382 1.5664 1.9899 1.4597 1.7985 3.2920 1.9778 1.2574 1.7717 1.5993 1.7569 1.5305 2.1703 1.4963 1.4901 6.2967 1.3143 3.4275 2.2528 1.8378 1.3773 1.2294 1.4040 2.2215 2.5999 1.4790 1.6095 1.0601 1.1178 1.5430 2.3473 1.3277 1.3152 1.2323 1.2560 1.2153 1.3223 1.2739 1.2612 1.4136 1.3667 1.5603 1.5344 1.4373 1.5259 7.5545 2.1834 1.0881 1.0897 1.0902 1.0883 1.0818 1.0999 1.2134 1.9383 6.0406 6.1920 1.0811 1.0621 1.0616 1.0599 1.0622 1.0592 1.0681 1.0601 1.0998 1.0970 1.0989 1.0954 1.1006 1.1035 1.1027 1.0871 1.0867 1.0906 1.0957 1.1015
irintensity: 0.0010 0.0034 0.0623 0.0752 0.2952 0.0360 0.4628 0.2433 0.0318 0.2238 0.4631 0.0009 0.0240 0.2532 0.2001 13.6682 2.9535 4.3543 0.0752 51.5232 8.7665 36.4300 0.3607 0.8480 3.2760 7.1614 0.0423 0.7427 11.4063 2.2636 1.3372 5.5698 1.1826 2.1014 0.0296 0.0772 0.8213 10.2633 0.4043 1.4503 2.1504 3.9614 4.4550 0.1513 3.3732 5.7187 0.3864 0.1617 0.9248 0.1208 4.1252 2.3904 2.3272 4.2655 0.6572 1.2426 0.8371 0.1954 2.0158 0.1481 0.7617 1.4308 0.9030 1.9052 0.1519 6.2810 0.2803 4.5735 4.9213 8.2285 18.9216 3.5582 16.7123 15.5688 1.3926 14.3769 10.3699 18.6750 23.9272 73.3772 29.3714 27.3481 27.9274 44.0218 1.1464 88.2998 76.1292 45.9212 6.7794 131.5219 55.8393 9.3946 9.6919 10.8255 48.8291 26.2004
temp: 298.150 k
press: 1.00000 atm
elementType: 6 6 6 6 6 6 6 6 6 6 6 6 6 6 1 1 1 1 1 1 1 1 1 1 1 1 1 1 1 1 1 1 1 1
symmnumber: 1
zpe: 794333.4 jmol-1
zpe.correction: 0.302546 hartree
zpe.thermalcorrener: 0.315757 hartree
zpe.thermalcorrenthalpy: 0.316701 hartree
zpe.thermalcorrgfe: 0.260901 hartree
zpe.sumelectzpe: -544.427703 hartree
zpe.sumelectthermal: -544.414492 hartree
zpe.sumelectthermalent: -544.413548 hartree
zpe.sumelectthermalfe: -544.469348 hartree
dipole: -0.6556 -0.0623 0.0276
dipole: 0.6591
quadrupole: -84.9907 -83.9797 -87.0678
quadrupole: -1.3493 -2.1034 -3.9921
quadrupole: 0.3554 1.3664 -1.7217 -1.3493 -2.1034 -3.9921
hfenergy: -544.7302491 hartree
pointgroup: C01 [X(C14H20)]
dipole: 0.2580938 0.0219057 0.0121517 debye
polarizability: 191.0509388|-7.0198293|131.1321648|11.2043105|12.7154179|110.9818327 unknown
InChI: InChI=1S/C14H20/c1-3-7-13(8-4-1)11-12-14-9-5-2-6-10-14/h1,3-4,7-8,14H,2,5-6,9-12H2
charge 0 multiplicity 1
34 atoms
C  1.905237 0.309773 0.215977
C  2.457621 -1.13844 0.294315
C  2.769628 1.154605 -0.757908
C  3.960312 -1.171829 0.665231
C  4.271906 1.12675 -0.389138
C  4.804582 -0.32343 -0.314675
C  0.413726 0.359745 -0.200524
C  -0.562534 -0.295313 0.81817
C  -2.016424 -0.155273 0.392046
C  -2.7913 0.963161 0.795528
C  -2.619133 -1.117309 -0.459805
C  -4.127208 1.118265 0.361359
C  -3.954064 -0.967781 -0.897949
C  -4.714069 0.152696 -0.489162
H  1.997047 0.763266 1.22975
H  2.313754 -1.625464 -0.694609
H  1.8820 -1.732719 1.030033
H  2.400733 2.199821 -0.772759
H  2.63857 0.75635 -1.787021
H  4.324058 -2.217877 0.679089
H  4.0904 -0.774029 1.693562
H  4.415084 1.617758 0.596225
H  4.855004 1.712626 -1.126339
H  5.868794 -0.327231 -0.008219
H  4.757856 -0.780575 -1.325256
H  0.289716 -0.132289 -1.187678
H  0.111622 1.417811 -0.34196
H  -0.408069 0.178686 1.807928
H  -0.308786 -1.366445 0.928908
H  -2.344212 1.714539 1.459145
H  -2.037178 -1.992198 -0.77717
H  -4.710545 1.986956 0.688132
H  -4.40242 -1.724285 -1.55243
H  -5.750611 0.269477 -0.825195
