program: Gaussian 09
title: 000281956
version: EM64L-G09RevD.01
frameworkgroup: C1[X(C16H18N4O6)]
method: RPBEPBE
basis: SDD
operation: Freq
keyword: #p
keyword: freq=noraman
keyword: PBEPBE/SDD
title: #p freq=noraman PBEPBE/SDD
converged: YES YES NO NO
title: Mulliken charges:
elementType: O O O O O O N N N N C C C C C C C C C C C C C C C C H H H H H H H H H H H H H H H H H H
charge: -0.256405 -0.252728 -0.189030 -0.273567 -0.213021 -0.207617 0.007674 -0.440321 0.022786 0.015614 -0.302314 -0.136725 -0.060332 -0.520323 -0.501789 -0.558333 0.095775 -0.401670 0.293949 0.294120 -0.753186 0.262088 -0.295604 -0.498618 -0.368507 0.445494 0.289009 0.248506 0.260200 0.244119 0.247416 0.220673 0.229795 0.261130 0.239133 0.244730 0.240796 0.384472 0.248250 0.255084 0.250840 0.300934 0.335406 0.292095
chargesum: 0.00000
title: Mulliken charges with hydrogens summed into heavy atoms:
elementType: O O O O O O N N N N C C C C C C C C C C C C C C C C
charge: -0.256405 -0.252728 -0.189030 -0.273567 -0.213021 -0.207617 0.007674 -0.055849 0.022786 0.015614 -0.013304 0.111781 0.199868 -0.028788 -0.051320 -0.058069 0.095775 0.083856 0.293949 0.294120 0.000988 0.262088 0.005330 -0.163212 -0.076412 0.445494
polarizability: 3.96458014e+02 -3.97714235e+01 2.77379241e+02 -1.34645118e+01 -7.70547585e+00 1.32732426e+02
1716.lowfreq: -43.0919 -7.7246 -3.6075 -0.0007 0.0002 0.0004 5.0066 17.1452 21.6742
frequency: -43.0908 17.1144 21.5951 27.9655 44.0393 53.4742 58.0985 63.1306 77.9201 78.1754 132.6306 144.2221 152.7184 163.6142 178.4910 196.0497 234.7055 268.5596 303.8157 306.4280 316.3019 355.3279 361.7929 379.7361 397.7677 418.1238 441.0613 453.8893 458.5727 498.2083 512.7809 515.2845 546.1318 576.1342 580.9861 604.8581 617.3359 645.1474 652.4779 673.2459 706.0010 725.1552 731.1644 753.3566 764.0946 779.1723 810.9543 814.5004 824.9145 849.2653 862.0298 863.6132 876.8069 889.2287 915.6221 926.9764 948.4182 953.2027 955.2052 964.6983 994.3995 1002.7627 1011.7669 1015.8282 1027.3257 1041.1612 1048.7490 1052.7178 1086.0510 1100.5767 1105.9465 1127.6194 1136.9566 1150.9793 1164.4371 1166.6970 1188.0920 1203.4285 1213.1760 1222.1387 1232.3589 1234.0434 1248.9009 1263.4771 1268.8494 1282.0752 1299.4880 1302.3328 1311.0686 1335.8492 1339.9266 1359.3611 1360.8425 1385.6459 1387.0008 1439.1451 1449.4631 1450.0135 1456.1993 1457.5559 1474.7367 1476.7045 1490.8683 1516.1876 1577.9766 1617.0152 1625.5346 1644.2158 2972.5951 2997.4860 3009.5122 3019.8873 3026.8496 3028.6665 3029.1173 3066.5952 3082.6947 3092.5340 3096.4994 3096.9729 3120.9508 3142.2747 3180.0556 3188.9458 3200.5934 3240.2151
redmass: 1.0566 6.0965 6.7317 6.9499 5.9789 5.6662 9.4359 4.8827 6.9733 7.0975 3.5744 8.8676 5.7343 5.4446 5.1153 7.7113 5.5284 3.8828 3.5757 4.3735 8.6277 3.8858 4.9777 3.4088 4.1239 3.9375 2.8557 3.5240 4.0078 5.4107 3.9384 3.7004 3.1466 3.5621 3.8911 4.6796 5.4829 5.1580 7.9295 8.7478 7.7941 4.9013 5.5935 12.1925 4.5649 4.1230 1.3712 2.3809 3.5662 3.5676 2.1131 1.4781 2.0242 6.4918 2.6937 2.0599 2.8569 2.0777 2.8008 1.4016 1.7473 1.8272 1.3131 4.2087 1.5827 1.7696 1.6878 2.1022 1.6146 3.9810 1.2706 1.4234 1.3540 1.5781 3.0753 2.6144 3.2133 2.9766 4.5298 1.4300 1.3548 1.8500 1.4725 1.4910 1.3663 1.7421 1.7873 1.7647 1.5462 1.3402 4.2459 3.1842 1.7262 1.2306 4.6381 1.1113 3.5884 1.2019 1.0768 1.0462 1.0907 2.7261 1.0996 4.0927 5.0161 10.6994 7.5940 9.6717 1.0601 1.0624 1.0367 1.0587 1.0663 1.0964 1.0841 1.1014 1.0903 1.1075 1.1061 1.0971 1.0904 1.1012 1.0894 1.0919 1.0963 1.0790
irintensity: 1.7316 0.3709 0.4773 2.3513 2.3120 1.1750 0.0649 1.6793 2.2316 0.3439 2.2033 0.6860 1.0228 1.9992 3.0299 4.1742 13.1615 3.9464 8.5672 3.1217 1.6041 0.5431 0.3921 1.1416 0.5241 4.3832 9.2177 2.2325 4.4750 2.3427 6.5516 9.4943 2.7790 1.3447 18.8704 0.8982 10.9690 4.3557 15.7999 8.4998 7.9100 1.2827 3.6249 8.9823 2.0342 18.4084 59.5642 35.9394 3.4023 7.4498 10.1242 17.1124 8.4278 6.5990 4.9652 0.7788 43.8886 4.1547 16.9475 24.0749 69.8993 32.0972 0.0368 37.6245 4.7230 1.0191 15.2150 44.5869 2.8881 58.5360 14.1624 3.6590 45.5039 3.1455 192.5341 164.6143 310.8023 111.5799 383.5968 16.8912 12.6608 131.1634 19.2329 8.0598 2.3996 4.5794 22.8797 87.3105 13.2752 12.1188 213.9272 57.3564 22.8977 49.7777 29.8957 12.2209 1.4884 11.1167 15.3920 17.7823 11.9876 38.3851 8.5101 132.9497 106.8817 12.7156 554.5559 169.2108 8.4138 39.2022 1.9143 35.5249 20.6910 17.6004 6.7111 30.0683 53.3720 24.9105 21.0160 8.8913 5.4536 7.5366 3.1419 20.2102 0.0587 62.1800
temp: 298.150 k
press: 1.00000 atm
elementType: 8 8 8 8 8 8 7 7 7 7 6 6 6 6 6 6 6 6 6 6 6 6 6 6 6 6 1 1 1 1 1 1 1 1 1 1 1 1 1 1 1 1 1 1
symmnumber: 1
zpe: 875561.1 jmol-1
zpe.correction: 0.333484 hartree
zpe.thermalcorrener: 0.356241 hartree
zpe.thermalcorrenthalpy: 0.357186 hartree
zpe.thermalcorrgfe: 0.277786 hartree
zpe.sumelectzpe: -1288.760466 hartree
zpe.sumelectthermal: -1288.737709 hartree
zpe.sumelectthermalent: -1288.736764 hartree
zpe.sumelectthermalfe: -1288.816164 hartree
dipole: 9.2308 -1.0538 0.8328
dipole: 9.3280
quadrupole: -197.6269 -156.0308 -151.6384
quadrupole: 0.3422 11.2468 2.5681
quadrupole: -29.1949 12.4012 16.7936 0.3422 11.2468 2.5681
hfenergy: -1289.0939499 hartree
pointgroup: C01 [X(C16H18N4O6)]
dipole: -3.6121175 -0.5628647 -0.3224703 debye
polarizability: 392.7876538|44.8837887|280.7119293|-14.0916635|9.1029057|133.070097 unknown
InChI: InChI=1S/C16H18N4O6/c1-9(21)26-8-11-4-10-5-13(11)15(6-10)18-17-14-3-2-12(19(22)23)7-16(14)20(24)25/h2-3,7,10-11,13,17H,4-6,8H2,1H3
charge 0 multiplicity 1
44 atoms
O  -4.83773 1.493713 -0.98191
O  -5.548641 1.641407 1.240776
O  4.54923 -2.638994 -0.315864
O  2.297762 -2.91601 -0.109299
O  5.353909 3.571919 0.138571
O  6.622154 1.692512 -0.151974
N  -0.48884 -0.220148 0.397243
N  0.753043 -0.849339 0.226613
N  3.36988 -2.150498 -0.151524
N  5.488017 2.289817 0.015828
C  -2.948627 -0.507164 0.59095
C  -3.146368 -2.779312 0.375136
C  -3.617596 -0.676918 -0.827724
C  -3.591754 -1.683003 1.388727
C  -3.75967 -2.244241 -0.955463
C  -1.604047 -2.550995 0.333464
C  -1.528298 -1.020638 0.4366
C  -4.986746 0.009606 -0.946894
C  -5.16526 2.198886 0.186464
C  1.901195 -0.098788 0.176835
C  -4.992186 3.687185 -0.018066
C  3.201267 -0.707003 -0.007475
C  1.848536 1.330121 0.305812
C  4.373455 0.079274 -0.05937
C  3.004238 2.101976 0.254811
C  4.267217 1.467852 0.071003
H  -3.023507 0.502667 1.014254
H  -3.430563 -3.815065 0.616224
H  -2.95954 -0.261563 -1.611951
H  -3.156074 -1.813436 2.394478
H  -4.685571 -1.586312 1.487927
H  -3.24229 -2.639806 -1.846911
H  -4.823146 -2.54057 -1.031318
H  -1.104944 -3.031047 1.199984
H  -1.127502 -2.95003 -0.583335
H  -5.65969 -0.261074 -0.113682
H  -5.458128 -0.241352 -1.912427
H  0.880542 -1.876651 0.127007
H  -4.233545 4.068667 0.687645
H  -4.687261 3.917423 -1.048509
H  -5.940815 4.199888 0.216747
H  0.86525 1.78246 0.445509
H  5.345924 -0.399155 -0.200583
H  2.968819 3.190039 0.352874
