program: Gaussian 09
title: 000281889
version: EM64L-G09RevD.01
frameworkgroup: C1[X(C21H11NO4)]
method: RPBEPBE
basis: SDD
operation: Freq
keyword: #p
keyword: freq=noraman
keyword: PBEPBE/SDD
title: #p freq=noraman PBEPBE/SDD
converged: YES YES NO NO
title: Mulliken charges:
elementType: O O O O N C C C C C C C C C C C C C C C C C C C C C H H H H H H H H H H H
charge: -0.261047 -0.361393 -0.164431 -0.165977 0.035450 0.315034 0.182052 -0.191352 0.270419 0.243382 -0.237223 0.295748 -0.196044 0.159690 -0.616875 0.079477 -0.383089 -0.372835 0.305728 -0.231351 -0.228185 -0.348473 -0.365700 -0.229380 -0.225461 -0.230941 0.254350 0.290292 0.291091 0.238911 0.238463 0.363073 0.260455 0.282717 0.232472 0.235996 0.234956
chargesum: 0.00000
title: Mulliken charges with hydrogens summed into heavy atoms:
elementType: O O O O N C C C C C C C C C C C C C C C C C C C C C
charge: -0.261047 0.001680 -0.164431 -0.165977 0.035450 0.315034 0.182052 -0.191352 0.270419 0.243382 -0.237223 0.295748 -0.196044 0.159690 -0.362525 0.079477 -0.092797 -0.081743 0.305728 0.007561 0.010278 -0.088018 -0.082983 0.003092 0.010535 0.004015
polarizability: 5.13920967e+02 -6.99585360e+00 2.92522984e+02 -2.97371518e-03 2.80090098e-02 8.97323457e+01
1716.lowfreq: -4.6982 -0.8480 -0.0008 -0.0005 0.0005 6.1565 20.4086 31.6050 47.0954
frequency: 20.2148 31.5943 47.0757 61.5786 61.9761 114.0434 120.1713 146.8999 162.7627 189.2090 218.6915 253.9447 268.0101 301.7681 302.5162 342.6410 370.2540 371.9442 378.8498 402.3345 403.4032 418.0926 437.4769 443.7741 464.7522 490.0504 499.5500 517.6511 528.0847 577.9584 613.0355 640.0577 641.3408 674.3842 683.4304 697.3179 698.2216 712.2804 739.4340 757.7437 760.2014 784.1580 804.9154 814.9645 833.7134 835.0840 861.3330 873.0583 873.1957 905.9660 939.9318 947.3479 953.1706 988.0482 993.0366 999.6153 1008.5813 1015.8571 1018.6082 1027.1488 1050.8316 1075.5231 1086.3020 1095.2206 1149.2267 1168.3601 1173.6478 1175.8408 1184.1437 1192.0849 1219.5450 1253.1443 1270.4339 1285.0470 1313.5579 1323.3821 1385.8341 1393.5944 1402.9097 1417.3540 1425.7360 1439.9817 1441.4214 1464.9832 1471.0647 1529.0966 1535.3892 1554.2532 1581.0120 1593.0182 1597.7776 1611.9767 1621.2805 1635.2253 3133.2952 3135.5613 3144.6944 3150.2103 3151.4386 3157.0348 3163.2844 3167.0479 3171.8115 3175.2566 3526.9738
redmass: 7.6418 8.2434 4.1013 5.7745 7.5448 4.7180 8.5829 6.7395 6.1506 6.2982 7.0398 5.9335 5.9850 7.1782 5.8030 8.9474 10.6271 3.1896 12.2400 2.6218 1.5957 3.7902 7.1706 3.7787 9.8020 4.1043 9.8063 4.3514 8.8723 7.0876 6.4853 5.1558 6.7027 5.9367 6.8434 1.8141 5.4000 7.2515 2.4634 7.1817 3.9799 1.9206 10.2631 2.1676 9.1768 1.6039 1.2463 8.8357 2.6317 6.4656 2.0773 1.4157 8.7833 6.2527 1.3789 1.3905 1.3330 1.3617 3.6530 2.1074 3.1138 3.1293 1.8209 2.2539 1.6006 1.3374 1.4508 1.0586 2.0476 1.5785 2.4793 2.0306 4.0237 4.7151 3.6035 1.4411 8.2517 9.8178 9.9933 3.8292 4.4053 2.5879 2.4899 2.3502 2.6411 7.9323 11.4266 8.9545 6.4516 7.7392 7.7733 6.8048 7.1519 8.6970 1.0856 1.0863 1.0889 1.0933 1.0903 1.0934 1.0945 1.0964 1.1000 1.1008 1.0657
irintensity: 6.4816 2.1660 1.0742 0.3731 0.4134 0.0124 0.3413 0.6321 1.7223 0.1140 0.8613 0.0221 2.0113 2.7853 2.2291 0.2324 2.4723 24.6051 26.6225 6.9258 68.0148 4.7176 16.7162 16.1576 6.0075 4.7732 2.2880 15.1589 0.2923 14.1582 0.5994 12.2330 14.6344 14.8885 13.8827 50.2899 5.9821 4.8010 25.1131 11.3584 41.5931 40.1950 74.3197 32.6105 30.7943 38.1098 0.0023 32.6108 0.1349 38.0508 0.0230 5.1422 38.1799 0.6592 0.0215 4.2179 0.4498 0.0279 45.3693 0.8911 2.3101 99.5001 4.6862 85.3036 36.5971 57.7307 62.3971 0.2981 79.9244 10.1587 1.9476 2.1364 275.3879 526.5005 54.6020 14.2182 4.0696 54.3363 11.8090 32.2527 80.6918 7.1513 23.2727 62.7430 3.5257 62.3970 40.2870 293.0922 3.2089 7.7428 9.2032 4.5861 50.5503 46.5062 0.5321 4.2748 10.3074 3.9815 8.7374 18.7333 1.4870 11.7399 38.0417 25.9821 37.6947
temp: 298.150 k
press: 1.00000 atm
elementType: 8 8 8 8 7 6 6 6 6 6 6 6 6 6 6 6 6 6 6 6 6 6 6 6 6 6 1 1 1 1 1 1 1 1 1 1 1
symmnumber: 1
zpe: 689271.9 jmol-1
zpe.correction: 0.262530 hartree
zpe.thermalcorrener: 0.281951 hartree
zpe.thermalcorrenthalpy: 0.282895 hartree
zpe.thermalcorrgfe: 0.213240 hartree
zpe.sumelectzpe: -1160.751208 hartree
zpe.sumelectthermal: -1160.731787 hartree
zpe.sumelectthermalent: -1160.730843 hartree
zpe.sumelectthermalfe: -1160.800498 hartree
dipole: 3.0487 1.5930 0.0024
dipole: 3.4398
quadrupole: -119.1067 -128.8139 -152.2988
quadrupole: 16.0593 0.0003 -0.0076
quadrupole: 14.2998 4.5926 -18.8924 16.0593 0.0003 -0.0076
hfenergy: -1161.0137376 hartree
pointgroup: C01 [X(C21H11N1O4)]
dipole: -1.2064998 0.6130718 0.0027716 debye
polarizability: 513.7329474|9.5060608|292.6975416|0.5077574|1.6259539|89.7458071 unknown
InChI: InChI=1S/C21H11NO4/c23-14-10-15-18(22-21(26-15)11-6-2-1-3-7-11)17-16(14)19(24)12-8-4-5-9-13(12)20(17)25/h1-10,23H
charge 0 multiplicity 1
37 atoms
O  -2.459833 1.575179 0.012056
O  1.928728 3.774241 0.034458
O  0.739394 -2.25236 -0.01397
O  4.004579 2.194915 0.023589
N  -1.594612 -0.586885 -0.003951
C  0.887272 0.165183 0.004693
C  1.723513 1.339547 0.014794
C  -0.522303 0.337891 0.004605
C  2.96028 -1.340622 -0.005878
C  3.788685 -0.188063 0.003938
C  1.473954 -1.216971 -0.005676
C  -1.063772 1.659527 0.01444
C  3.215598 1.198825 0.014934
C  1.113348 2.647185 0.024681
C  -0.295415 2.81593 0.024482
C  -2.704791 0.137186 0.000344
C  3.543988 -2.632775 -0.016214
C  5.19806 -0.339045 0.003251
C  -4.092043 -0.303327 -0.004991
C  4.944359 -2.775775 -0.016836
C  5.77398 -1.624227 -0.007067
C  -5.163693 0.631399 -0.000002
C  -4.366939 -1.700193 -0.015481
C  -6.495214 0.169941 -0.005482
C  -5.700722 -2.150145 -0.020849
C  -6.768273 -1.218854 -0.015873
H  -0.752645 3.810768 0.03182
H  2.876437 -3.500014 -0.023673
H  5.812542 0.56647 0.01087
H  5.394041 -3.774389 -0.024875
H  6.863637 -1.735609 -0.007586
H  1.37771 4.599879 0.041329
H  -4.94489 1.703452 0.008023
H  -3.526751 -2.402034 -0.019226
H  -7.320374 0.890062 -0.001679
H  -5.91126 -3.224766 -0.028922
H  -7.804878 -1.573326 -0.020075
