program: Gaussian 09
title: 000281986
version: EM64L-G09RevD.01
frameworkgroup: C1[X(C20H25NO5)]
method: RPBEPBE
basis: SDD
operation: Freq
keyword: #p
keyword: freq=noraman
keyword: PBEPBE/SDD
title: #p freq=noraman PBEPBE/SDD
converged: YES YES NO NO
title: Mulliken charges:
elementType: O O O O O N C C C C C C C C C C C C C C C C C C C C H H H H H H H H H H H H H H H H H H H H H H H H H
charge: -0.292110 -0.319494 -0.249091 -0.459414 -0.336039 -0.138418 0.166584 0.264554 -0.542049 -0.522991 -0.415110 -0.630744 0.142411 0.247297 -0.603943 0.380408 0.126346 -0.009842 -0.673845 0.003046 -0.461054 0.195994 -0.369405 -0.501540 -0.524191 -0.519683 0.260709 0.238366 0.238646 0.222579 0.189169 0.222348 0.294739 0.269196 0.247860 0.219673 0.219292 0.193095 0.258615 0.234566 0.240303 0.385380 0.220612 0.245494 0.243349 0.205476 0.279305 0.218860 0.224139 0.242873 0.227682
chargesum: 0.00000
title: Mulliken charges with hydrogens summed into heavy atoms:
elementType: O O O O O N C C C C C C C C C C C C C C C C C C C C
charge: -0.292110 -0.319494 -0.249091 -0.074034 -0.336039 -0.138418 0.166584 0.264554 -0.042974 -0.061766 -0.003593 -0.066809 0.142411 0.247297 -0.136410 0.380408 0.126346 -0.009842 -0.002843 0.003046 -0.226488 0.195994 -0.129103 0.207914 0.179450 0.175010
polarizability: 2.76983332e+02 -2.12768823e+01 2.14235209e+02 1.90441718e+01 3.95230779e+00 2.17591506e+02
1716.lowfreq: -5.2930 -0.0002 0.0003 0.0005 7.9233 13.8201 31.8880 38.3734 57.3927
frequency: 31.8249 38.3252 57.3768 59.1620 63.6070 76.4127 86.7258 96.4970 122.8359 137.2566 154.9183 158.5898 168.1654 183.9442 187.9874 201.5805 215.3706 226.5395 234.9238 240.7990 268.0975 275.6702 298.5300 307.3059 320.5842 325.8820 337.2016 350.8619 355.8767 375.0336 379.4035 424.3199 431.8301 459.3213 489.1212 500.3161 510.0472 518.2148 538.8430 560.9538 570.1689 589.3633 614.6804 629.5088 652.5398 670.3500 698.0518 699.9935 731.4274 749.3493 783.6133 800.7921 825.1853 828.5131 876.0774 889.0648 903.4143 910.9109 928.4484 944.6599 966.2652 989.6688 1007.5460 1017.6682 1033.8809 1038.5485 1045.9800 1061.0826 1091.9407 1098.6009 1103.0806 1107.5383 1117.8282 1118.4609 1121.7285 1143.9253 1147.4337 1155.7860 1156.5964 1165.6875 1173.6367 1177.7550 1188.0792 1196.0686 1202.4106 1215.2374 1227.2096 1236.6731 1257.2335 1260.0929 1265.7812 1275.0771 1305.1394 1310.0098 1317.4635 1325.7617 1341.8273 1350.1077 1394.8533 1413.0991 1428.6488 1433.1988 1435.6051 1440.9312 1449.5397 1451.0087 1456.9282 1457.4968 1460.1625 1463.1624 1464.7379 1467.7151 1479.8922 1481.2755 1483.8874 1488.2528 1491.5447 1505.2344 1566.2500 1588.1731 1591.7230 1622.6440 2867.0079 2877.0525 2965.6873 2967.1254 2974.3073 2985.5943 2991.2885 3000.1909 3005.6823 3016.3533 3025.1148 3027.0623 3055.4486 3077.3544 3080.4492 3092.2261 3102.9400 3109.7587 3120.3018 3121.6330 3124.6235 3126.8773 3130.5473 3160.7970 3481.7934
redmass: 4.2981 3.8953 4.2213 2.6007 2.5042 4.2324 3.8389 2.9898 2.9450 3.6988 1.4878 2.1011 1.7990 1.2433 1.8390 3.2716 2.7778 1.2679 3.5009 3.2605 3.4249 3.3211 4.4822 4.2722 3.9525 4.9036 3.7701 3.6769 3.6914 3.3241 5.0962 4.0093 3.9980 4.9206 5.3683 5.5312 3.3526 1.1193 4.1562 4.4583 4.0279 4.5705 4.9294 4.5561 4.4038 4.7470 3.8205 5.2971 5.4620 6.0107 1.4723 3.6176 1.6673 1.9127 3.0853 4.1071 2.7912 1.6252 3.8174 3.6323 2.1954 2.7642 3.8486 2.3714 3.3662 3.1910 3.5507 3.3279 2.7900 2.0923 1.2606 1.2527 1.2607 1.5535 2.4148 1.6977 1.5658 1.6414 1.5026 2.3447 1.4663 1.7316 2.8411 2.0082 1.7055 1.5736 1.6660 1.4602 2.2109 2.3000 2.5935 1.8293 1.5860 4.4812 1.9459 1.5175 1.4660 1.6748 4.4312 1.1638 1.1460 1.3768 1.1681 1.1024 1.0645 1.0559 1.1326 1.1114 1.8113 1.2228 1.0540 1.0702 1.1581 2.1361 1.0749 1.0987 1.0569 1.0856 8.7770 7.7544 9.7162 7.0950 1.0586 1.0709 1.0324 1.0348 1.0614 1.0667 1.0889 1.0673 1.0282 1.0767 1.0721 1.0859 1.1044 1.0983 1.0967 1.1021 1.0953 1.0927 1.1060 1.1053 1.0899 1.0988 1.1049 1.0949 1.0642
irintensity: 1.1497 1.6149 2.6079 3.1956 2.6377 3.2051 4.0213 2.4311 0.8731 3.1729 1.0846 1.6864 1.3662 1.5867 3.3512 1.8355 2.8816 0.3044 7.9961 1.0001 3.0885 5.4412 2.6503 1.3371 2.5353 4.7482 0.3422 2.8988 2.1887 1.7853 2.3784 11.1416 6.2497 9.8611 6.3705 1.0417 6.0863 101.3876 9.1540 0.2149 1.1622 8.3374 1.0691 13.7130 1.3765 19.2930 1.8884 9.9175 12.9174 2.7529 27.9399 21.3518 3.8407 26.3971 12.6247 10.8845 9.6722 0.8400 27.9288 18.9449 47.4144 26.9643 73.7865 40.3233 25.7077 16.0760 50.7149 48.0861 64.9625 40.3696 2.2585 14.0858 0.2161 2.3132 38.3564 8.0212 1.5864 30.3257 5.0798 128.5957 10.8438 13.7469 50.5372 12.5483 12.9010 61.7319 40.8178 67.6254 23.3790 17.2815 118.4378 24.2040 23.0643 53.1441 7.3285 17.1650 4.0704 11.7042 14.6713 33.2496 6.9432 59.1188 1.2463 11.8964 14.9733 8.7454 7.8845 24.4056 73.2818 36.6547 14.0569 25.6526 1.6752 37.7173 9.7563 6.9057 27.4496 3.2368 234.1435 27.5807 101.4712 7.9140 74.3258 177.0354 68.8067 73.8775 28.5602 11.0386 55.4041 17.8098 61.8520 56.2625 8.8309 65.0655 42.6001 21.6048 42.8188 16.1437 15.7928 1.6518 21.2550 10.9995 23.2251 9.6538 21.2916 16.6139 92.2197
temp: 298.150 k
press: 1.00000 atm
elementType: 8 8 8 8 8 7 6 6 6 6 6 6 6 6 6 6 6 6 6 6 6 6 6 6 6 6 1 1 1 1 1 1 1 1 1 1 1 1 1 1 1 1 1 1 1 1 1 1 1 1 1
symmnumber: 1
zpe: 1090900.7 jmol-1
zpe.correction: 0.415502 hartree
zpe.thermalcorrener: 0.441044 hartree
zpe.thermalcorrenthalpy: 0.441988 hartree
zpe.thermalcorrgfe: 0.361297 hartree
zpe.sumelectzpe: -1205.973348 hartree
zpe.sumelectthermal: -1205.947806 hartree
zpe.sumelectthermalent: -1205.946862 hartree
zpe.sumelectthermalfe: -1206.027553 hartree
dipole: -2.0766 -1.0626 4.4181
dipole: 4.9961
quadrupole: -118.0717 -150.0286 -158.1521
quadrupole: -4.8644 1.8327 11.5803
quadrupole: 24.0125 -7.9445 -16.0680 -4.8644 1.8327 11.5803
hfenergy: -1206.3888503 hartree
pointgroup: C01 [X(C20H25N1O5)]
dipole: 0.8978714 0.5975159 1.6433102 debye
polarizability: 273.5197667|-26.5546565|215.6880949|-18.0038246|-1.7967273|219.6021851 unknown
InChI: InChI=1S/C20H25NO5/c1-21-10-9-19-11-13(22)17(25-3)18(26-4)20(19,21)8-7-12-5-6-14(24-2)16(23)15(12)19/h5-6,23H,7-11H2,1-4H3
charge 0 multiplicity 1
51 atoms
O  -3.199808 -0.188108 1.247313
O  -2.502335 -2.690742 -0.025097
O  -0.643489 -2.490029 -2.189671
O  2.448333 0.416377 -1.949489
O  4.557396 -0.427607 -0.654591
N  -2.307481 1.938009 -0.821812
C  -0.170912 0.900979 -0.767835
C  -1.497791 1.043231 0.067887
C  0.021681 2.348107 -1.343138
C  -1.177577 1.653494 1.466899
C  -1.405344 2.955466 -1.423588
C  -0.448658 -0.069329 -1.953837
C  1.043745 0.464582 0.067335
C  -2.208833 -0.307041 0.277292
C  -0.26302 0.70677 2.265231
C  0.998915 0.345622 1.491717
C  -0.93932 -1.441279 -1.530735
C  -1.85938 -1.477727 -0.373279
C  -3.586895 2.474177 -0.339742
C  2.286528 0.216911 -0.567735
C  2.141627 -0.076716 2.208589
C  3.423655 -0.217892 0.167065
C  3.359365 -0.381095 1.559964
C  -4.305248 -1.166727 1.368606
C  -1.600583 -3.830095 0.26502
C  5.774547 -0.922872 -0.013528
H  0.527375 2.30313 -2.320643
H  0.663692 2.942499 -0.670597
H  -2.114282 1.828359 2.021896
H  -0.675369 2.629418 1.320852
H  -1.448069 3.922789 -0.866482
H  -1.721996 3.166756 -2.463484
H  0.443438 -0.189405 -2.584873
H  -1.255079 0.385338 -2.564433
H  -0.83092 -0.208206 2.527141
H  0.02233 1.176799 3.225833
H  -4.132534 2.921132 -1.19197
H  -3.474929 3.268193 0.439777
H  -4.205858 1.666859 0.080893
H  2.081455 -0.160333 3.299983
H  4.22786 -0.712208 2.136981
H  3.379549 0.152629 -2.184021
H  -5.064264 -0.639986 1.969375
H  -3.965001 -2.082153 1.874174
H  -4.699514 -1.430164 0.373877
H  -0.89109 -3.567542 1.074473
H  -1.051501 -4.118291 -0.645078
H  -2.267542 -4.642108 0.59577
H  6.146302 -0.201648 0.739568
H  6.511547 -1.029569 -0.822951
H  5.596882 -1.904955 0.464996
