program: Gaussian 09
title: 000282001
version: EM64L-G09RevD.01
frameworkgroup: C1[X(C22H30O3)]
method: RPBEPBE
basis: SDD
operation: Freq
keyword: #pfreq=noraman
keyword: PBEPBE/SDD
title: #p freq=noraman PBEPBE/SDD
converged: NO YES NO NO
title: Mulliken charges:
elementType: O O O C C C C C C C C C C C C C C C C C C C C C C H H H H H H H H H H H H H H H H H H H H H H H H H H H H H H
charge: -0.221569 -0.302569 -0.429207 0.348632 -0.270347 -0.178390 0.356527 0.347783 -0.509001 -0.521303 -0.217318 -0.462644 -0.533622 -0.445273 -0.452451 -0.789726 0.157711 -0.788245 -0.760024 0.241390 0.181194 -0.637847 -0.612513 0.541291 -0.817157 0.225014 0.239594 0.234043 0.201670 0.222489 0.211776 0.262382 0.209808 0.222082 0.202338 0.235602 0.196723 0.196658 0.200295 0.205430 0.233556 0.249958 0.214531 0.219142 0.216670 0.210221 0.212700 0.205855 0.228386 0.256423 0.219882 0.356517 0.222542 0.227974 0.234417
chargesum: 0.00000
title: Mulliken charges with hydrogens summed into heavy atoms:
elementType: O O O C C C C C C C C C C C C C C C C C C C C C C
charge: -0.221569 -0.302569 -0.072690 0.348632 -0.045333 0.061204 0.356527 0.347783 -0.073288 -0.087037 0.045064 -0.030754 -0.095683 -0.051893 -0.046726 -0.091681 0.157711 -0.142213 -0.113081 0.241390 0.181194 -0.381424 -0.392631 0.541291 -0.132224
polarizability: 2.86429620e+02 3.29318239e+00 2.24057078e+02 -1.87108330e+01 6.63436029e+00 2.03262076e+02
1716.lowfreq: -55.7375 -11.6779 -6.1868 -0.0008 -0.0006 0.0004 3.6460 20.9664 50.4601
frequency: -55.6256 20.6794 50.4175 74.2567 103.1580 119.6978 155.1347 162.9103 181.5895 194.6662 213.1341 220.0907 223.4852 232.2459 242.2048 249.3167 263.4220 268.1370 271.8778 289.1419 313.5077 317.7961 323.9933 333.6016 339.4782 370.6227 387.1593 408.0699 427.5886 437.2902 456.8436 481.5315 494.1555 505.5468 513.6598 524.7454 543.1134 557.6072 578.4235 586.2263 607.7578 638.9777 656.6512 701.7133 704.9954 736.0922 753.5801 775.9891 809.4847 810.6109 833.1267 852.2873 856.2987 861.2136 862.1474 884.2020 891.1968 909.6210 928.6782 931.7120 948.3905 959.4381 971.3942 975.6088 978.2410 982.3758 987.5578 1005.6623 1013.9358 1028.0451 1041.0808 1043.9300 1048.6719 1063.9468 1072.8213 1080.5182 1104.6163 1116.9288 1134.1683 1145.4253 1158.5774 1171.0494 1174.3179 1186.0533 1191.3058 1206.1864 1208.4572 1222.7099 1223.7338 1240.0834 1241.9132 1261.9678 1268.9079 1285.5161 1287.8068 1300.3720 1308.4057 1315.3129 1324.4310 1328.3560 1332.1014 1336.7068 1338.9363 1347.2272 1350.7392 1356.5601 1375.6279 1382.4590 1394.2380 1396.5721 1397.5153 1410.4868 1453.9913 1456.8526 1459.1736 1464.2175 1466.1486 1469.3908 1470.8931 1473.4278 1474.7540 1479.5838 1479.9607 1486.3414 1490.5367 1502.9288 1504.7856 1594.6387 1625.9257 2959.2167 2961.6591 2965.0311 2967.2791 2973.5040 2975.5111 2978.7694 2983.8492 2984.1764 2988.1071 2997.1295 3002.1301 3014.4826 3021.8859 3038.5113 3044.8705 3054.7809 3055.8553 3062.5120 3065.5322 3065.9669 3072.6240 3081.8365 3086.6904 3089.0238 3089.2885 3105.6265 3107.3363 3156.0610 3583.7363
redmass: 1.0168 3.8217 3.6823 4.6207 3.7723 2.1526 2.3872 2.6066 3.5880 3.0702 1.7662 1.6454 2.4241 1.8067 2.3684 2.1098 2.8312 2.6899 2.0716 2.6702 2.5182 2.0116 1.5709 2.1196 2.8886 2.6755 2.1953 4.8401 2.8613 2.8867 3.0519 3.7608 4.0110 3.6324 3.1749 3.5349 3.7722 4.0370 3.3433 3.4787 4.4437 3.2616 3.7034 4.0627 3.3445 2.6061 3.3265 4.5056 2.2010 1.6061 4.1243 1.6616 2.0256 1.5201 3.3842 3.3295 2.4690 2.0905 1.5779 1.8278 2.6411 2.5689 2.3966 1.9223 2.5315 2.5691 1.6022 2.4357 1.9967 2.1477 2.0096 1.5397 2.5837 1.5760 2.0181 2.0499 2.7331 2.3645 2.2839 1.9723 1.9655 1.5160 1.7172 2.1719 1.4918 1.5900 1.6660 1.6199 1.5328 1.9676 1.3835 2.1093 1.4769 1.3237 1.4263 1.4917 2.0848 1.4025 1.5356 1.4472 1.4768 1.5802 2.0087 1.4718 1.3242 1.4899 1.2041 1.2117 3.2112 1.5503 1.2067 3.2678 1.0739 1.0719 1.0761 1.0672 1.0738 1.0759 1.0631 1.0697 1.1355 1.0551 1.0565 1.0798 1.0705 1.0590 3.4527 6.9149 7.5713 1.0592 1.0669 1.0621 1.0382 1.0750 1.0381 1.0421 1.0468 1.0553 1.0624 1.0690 1.0795 1.0984 1.0979 1.1015 1.0977 1.0962 1.0994 1.0984 1.0922 1.0941 1.0968 1.0991 1.0991 1.0999 1.0965 1.0936 1.0912 1.0920 1.0660
irintensity: 0.3717 0.3125 0.7109 1.5131 3.5889 0.0638 1.3940 0.8340 2.3823 0.5999 0.2727 0.7836 0.2950 1.3032 1.5904 0.1444 12.2810 1.7724 1.9635 2.1175 5.0673 15.5272 74.6696 16.1526 2.5677 0.1045 1.5380 3.0377 0.2817 0.7579 0.5009 6.1546 0.9324 7.8653 4.5626 4.6013 6.6893 4.9358 10.0347 0.7129 1.8177 2.9466 1.1820 7.3662 3.6315 1.2240 11.6236 24.7588 1.8665 34.8686 0.3747 8.5620 5.8935 15.8276 10.4938 11.2183 0.9928 11.4574 0.6788 0.7154 29.1354 33.5238 10.5539 17.8416 35.4191 43.4301 12.9392 13.3782 9.1610 103.8098 26.0557 15.5812 16.0749 3.8146 3.9496 2.6536 25.4321 13.0538 66.6049 26.0525 18.1830 24.9619 32.7972 1.1068 5.7508 12.9380 37.5507 12.6413 7.1167 9.7243 20.1169 25.5912 3.1429 2.9353 1.8647 14.4375 11.3913 7.0022 4.5574 4.4614 4.1912 5.5073 25.1236 6.2322 2.0293 8.9707 17.9333 20.1869 5.3224 14.6989 16.8757 57.0833 3.9990 1.0718 5.3325 11.1535 1.1983 11.9049 17.4178 18.0404 38.9726 7.3171 3.2227 16.9912 4.8750 17.4852 7.8373 115.6854 157.9238 25.7898 47.8936 10.2022 36.2299 7.4073 42.3026 44.8863 17.7042 15.2054 54.0099 17.6273 48.7372 48.1343 27.8794 66.8082 9.5950 22.1252 3.8903 81.1717 11.0430 62.7468 28.8223 30.3256 17.2079 21.2273 35.5706 33.0745 21.1369 3.7455 30.6756
temp: 298.150 k
press: 1.00000 atm
elementType: 8 8 8 6 6 6 6 6 6 6 6 6 6 6 6 6 6 6 6 6 6 6 6 6 6 1 1 1 1 1 1 1 1 1 1 1 1 1 1 1 1 1 1 1 1 1 1 1 1 1 1 1 1 1 1
symmnumber: 1
zpe: 1240269.0 jmol-1
zpe.correction: 0.472394 hartree
zpe.thermalcorrener: 0.494844 hartree
zpe.thermalcorrenthalpy: 0.495788 hartree
zpe.thermalcorrgfe: 0.423659 hartree
zpe.sumelectzpe: -1080.106791 hartree
zpe.sumelectthermal: -1080.084341 hartree
zpe.sumelectthermalent: -1080.083397 hartree
zpe.sumelectthermalfe: -1080.155525 hartree
dipole: 0.4826 -1.0569 0.4239
dipole: 1.2368
quadrupole: -132.2565 -154.4834 -145.6141
quadrupole: 3.3692 -5.8879 -1.0012
quadrupole: 11.8615 -10.3654 -1.4961 3.3692 -5.8879 -1.0012
hfenergy: -1080.5791844 hartree
pointgroup: C01 [X(C22H30O3)]
dipole: 0.2003656 0.4296888 -0.1094568 debye
polarizability: 287.2337946|-7.9160891|222.068623|15.1665478|9.1506039|204.4463564 unknown
InChI: InChI=1S/C22H30O3/c1-13-10-14(23)17-15(11-13)25-21(4)9-6-16-20(2,3)7-5-8-22(16)12-24-18(17)19(21)22/h10-11,16,18-19,23H,5-9,12H2,1-4H3
charge 0 multiplicity 1
55 atoms
O  0.202759 -2.256306 -0.282965
O  0.828204 1.582893 -0.165616
O  3.228065 -2.569486 -0.883045
C  -1.520013 -0.572956 -0.292923
C  -0.422939 -0.1992 -1.392999
C  -2.098105 0.695149 0.432901
C  0.034461 1.275112 -1.424011
C  -3.336469 0.39197 1.369851
C  -2.658768 -1.376924 -0.994312
C  -2.410503 1.768263 -0.648025
C  0.770359 -1.192627 -1.162238
C  -0.714326 -1.542918 0.621252
C  -1.138328 2.277793 -1.370375
C  -4.408227 -0.44342 0.604335
C  -3.836314 -1.717647 -0.054589
C  0.940331 1.579399 -2.638407
C  1.971905 -0.565157 -0.476367
C  -3.996477 1.713553 1.858377
C  -2.886386 -0.35812 2.658312
C  1.924989 0.738828 0.071868
C  3.159922 -1.309839 -0.261165
C  2.972197 1.260681 0.866307
C  4.222475 -0.804974 0.520234
C  4.123293 0.48144 1.11279
C  5.24735 1.009703 1.987598
H  -0.859825 -0.410249 -2.387728
H  -1.296149 1.110335 1.07884
H  -2.219589 -2.303081 -1.414468
H  -3.048152 -0.792023 -1.852574
H  -2.913059 2.638194 -0.19379
H  -3.120661 1.351321 -1.38796
H  1.074356 -1.725819 -2.0766
H  -0.148657 -0.988118 1.398823
H  -1.317012 -2.331621 1.095452
H  -1.39278 2.580474 -2.403602
H  -0.745058 3.178794 -0.86356
H  -4.860778 0.192786 -0.184339
H  -5.227787 -0.7069 1.303183
H  -4.631097 -2.231174 -0.63016
H  -3.511379 -2.435925 0.723641
H  1.220898 2.6477 -2.636242
H  1.865727 0.978932 -2.62747
H  0.400833 1.36372 -3.578397
H  -3.243381 2.408829 2.27686
H  -4.539972 2.237755 1.052207
H  -4.730642 1.492223 2.656065
H  -2.11324 0.222255 3.197001
H  -3.749397 -0.483316 3.339886
H  -2.477295 -1.36156 2.464303
H  2.877236 2.274739 1.266194
H  5.130441 -1.404941 0.669455
H  4.049667 -3.047796 -0.610656
H  6.238792 0.774779 1.55939
H  5.179801 2.103855 2.112394
H  5.2112 0.556716 2.99737
