program: Gaussian 09
title: 000281846
version: EM64L-G09RevD.01
frameworkgroup: C1[X(C22H25NO2)]
method: RPBEPBE
basis: SDD
operation: Freq
keyword: #p
keyword: freq=noraman
keyword: PBEPBE/SDD
title: #p freq=noraman PBEPBE/SDD
converged: YES YES NO NO
title: Mulliken charges:
elementType: O O N C C C C C C C C C C C C C C C C C C C C C C H H H H H H H H H H H H H H H H H H H H H H H H H
charge: -0.300380 -0.301342 -0.120714 -0.152265 -0.525005 -0.390165 0.328663 -0.499943 -0.555235 0.308809 0.220512 0.125441 -0.534372 -0.564540 -0.830915 0.315303 0.165941 0.197398 -0.398947 -0.420520 -0.233753 -0.235602 -0.246414 -0.530726 -0.530226 0.201403 0.200339 0.247524 0.194973 0.214439 0.236097 0.199734 0.211691 0.234189 0.252175 0.257580 0.227311 0.255333 0.219967 0.243697 0.231732 0.225181 0.223650 0.228008 0.220541 0.253340 0.227500 0.221591 0.253699 0.227306
chargesum: 0.00000
title: Mulliken charges with hydrogens summed into heavy atoms:
elementType: O O N C C C C C C C C C C C C C C C C C C C C C C
charge: -0.300380 -0.301342 -0.120714 0.049138 -0.077142 0.019246 0.328663 -0.064112 -0.109355 0.308809 0.220512 0.125441 -0.282197 -0.306960 -0.128305 0.315303 0.165941 0.197398 -0.155250 -0.188788 -0.008572 -0.011952 -0.018406 0.170655 0.172369
polarizability: 3.72500857e+02 1.73252178e+01 2.41153405e+02 -1.56644660e+01 1.03185943e+01 1.54216371e+02
1716.lowfreq: -9.7255 -0.0005 0.0007 0.0009 3.2860 6.1177 24.1471 33.5781 50.5309
frequency: 23.9700 33.2533 50.5278 58.3892 68.0131 82.3622 105.8169 112.8001 131.2694 151.1154 159.4423 168.9652 174.9314 186.1288 199.9610 206.2770 208.2118 245.3413 273.9147 280.2578 284.7699 310.8821 335.2752 364.9639 387.8887 395.5146 405.4953 411.2079 427.9294 465.5202 490.9777 493.9647 514.2009 534.4539 544.5876 580.6719 617.6706 629.3798 645.4587 683.6825 703.4390 707.0310 715.3558 721.5377 741.5059 745.1034 771.6094 830.1777 852.5910 877.7750 887.9124 899.1882 909.1548 917.9776 931.8243 954.7630 963.9175 973.6244 976.1405 982.4187 989.7411 992.7615 1005.0819 1028.7766 1039.0154 1048.6242 1073.2872 1080.1831 1083.5123 1102.9816 1115.1174 1118.2482 1138.9182 1149.6907 1155.8679 1156.9692 1171.2373 1174.9758 1184.6335 1188.8695 1196.6660 1209.7144 1218.2183 1223.0864 1244.4622 1256.5376 1268.8695 1274.8107 1305.1899 1313.5822 1319.6398 1326.1054 1335.0831 1363.0774 1369.6366 1370.9176 1385.5396 1394.8401 1397.6902 1426.1541 1430.9298 1441.1313 1445.0601 1446.3611 1458.0370 1458.6308 1459.9927 1465.2417 1470.3659 1478.4255 1479.7688 1481.4197 1488.1699 1490.7370 1570.8432 1579.8649 1609.0232 1619.2560 1680.3999 2788.6138 2798.4307 2848.6816 2957.6438 2967.8326 2968.8778 2970.7786 2981.1711 2994.8645 3016.5381 3024.7745 3026.8089 3038.7890 3064.8906 3066.9256 3096.5586 3117.8135 3118.3800 3118.4540 3123.5802 3137.0901 3138.4237 3143.5517 3145.9306 3162.3874
redmass: 4.5633 3.8948 4.2362 3.5856 3.9727 3.3280 2.7327 3.3597 3.3382 2.6553 1.3053 1.1547 1.3574 2.5287 3.1504 2.9750 2.7720 2.3705 3.0601 4.4406 3.6408 3.2493 3.8291 2.8728 4.4419 5.1297 2.8479 3.4928 3.7215 3.7052 3.8241 3.6060 3.6009 3.2477 4.2375 3.5489 6.0150 4.1479 5.4690 5.4588 1.9839 3.0747 4.1934 5.1798 3.2305 2.8232 2.0225 3.8925 1.2528 1.7877 1.6075 2.1384 2.2052 1.6545 2.2382 5.1611 1.9084 1.6753 1.7763 2.9714 5.0972 1.3187 2.0737 2.1034 1.7573 2.0482 1.9477 2.4289 4.0054 2.6308 1.2418 1.2412 2.4918 1.4439 2.0159 1.4897 1.0559 1.7114 2.1720 1.1321 1.2922 1.5571 1.7436 1.3303 1.5168 2.1348 1.6633 3.7570 1.5276 1.4103 1.5418 1.7028 1.5996 2.1557 6.0939 4.8905 1.6477 1.4321 1.9050 1.1778 2.2638 1.0999 1.1335 1.3151 1.0958 1.0633 1.0602 1.0669 1.0563 1.0573 1.1125 2.3164 1.0574 3.1202 8.6114 5.8446 6.1284 7.1797 7.3209 1.0785 1.0714 1.0709 1.0409 1.0574 1.0311 1.0311 1.0607 1.0836 1.0998 1.0961 1.0876 1.1008 1.1035 1.1037 1.0963 1.1026 1.1020 1.0855 1.0870 1.0920 1.0912 1.0911 1.0962 1.1016
irintensity: 0.0372 0.0626 0.2173 0.2574 1.3009 4.5316 6.5501 0.5182 0.9807 0.2358 0.8370 0.7079 1.0447 3.4487 1.2900 1.7633 5.2922 6.8086 1.5937 6.8886 1.1785 5.7765 1.0627 4.0390 0.0631 2.3557 0.0940 3.3515 6.5318 3.8431 6.6372 2.8009 0.0887 0.8579 1.5080 6.5763 1.1192 6.1811 14.3605 1.6832 33.1994 20.7247 6.7827 12.8811 7.4865 3.6989 52.1846 1.2800 0.0628 3.8727 2.9882 2.9713 40.4248 7.2570 11.1497 94.5880 31.6680 1.1263 1.9463 3.3884 0.7627 0.0558 10.0255 8.6297 7.4321 0.7900 13.3713 4.2758 38.6232 4.1628 14.0482 4.7807 54.4110 11.3469 13.0378 15.2190 0.5067 51.8887 8.3998 0.2157 1.9146 18.4757 9.2875 3.7076 2.3910 3.0108 13.3311 135.9821 1.3200 4.2451 10.1361 15.5065 3.8134 31.0967 0.5748 7.2082 18.4900 4.4895 20.2132 0.1016 6.5564 4.7857 5.4096 15.2856 8.5721 8.8320 7.8666 4.0559 9.6175 6.7157 3.4178 26.3254 12.7862 195.8441 0.3165 2.1349 12.1908 3.3731 11.2273 33.7110 98.5056 126.7266 22.5221 52.8174 96.2328 67.5648 26.4660 23.1527 14.9878 27.5679 54.6220 32.7026 31.9622 23.7620 25.3290 24.9509 34.4466 2.8528 0.0563 18.7828 10.9869 1.9278 41.6768 27.7850
temp: 298.150 k
press: 1.00000 atm
elementType: 8 8 7 6 6 6 6 6 6 6 6 6 6 6 6 6 6 6 6 6 6 6 6 6 6 1 1 1 1 1 1 1 1 1 1 1 1 1 1 1 1 1 1 1 1 1 1 1 1 1
symmnumber: 1
zpe: 1089069.8 jmol-1
zpe.correction: 0.414805 hartree
zpe.thermalcorrener: 0.438178 hartree
zpe.thermalcorrenthalpy: 0.439122 hartree
zpe.thermalcorrgfe: 0.361885 hartree
zpe.sumelectzpe: -1056.663358 hartree
zpe.sumelectthermal: -1056.639984 hartree
zpe.sumelectthermalent: -1056.639040 hartree
zpe.sumelectthermalfe: -1056.716277 hartree
dipole: -0.0856 -0.1286 -0.5746
dipole: 0.5950
quadrupole: -134.3406 -139.3458 -147.8098
quadrupole: 4.1223 -2.7925 4.7411
quadrupole: 6.1582 1.1529 -7.3111 4.1223 -2.7925 4.7411
hfenergy: -1057.0781624 hartree
pointgroup: C01 [X(C22H25N1O2)]
dipole: 0.0332524 -0.0426381 0.2277497 debye
polarizability: 372.1165758|-19.2390512|240.663842|-15.185212|-13.3097143|155.0902143 unknown
InChI: InChI=1S/C22H25NO2/c1-15-11-20-18-13-22(25-3)21(24-2)12-17(18)9-10-23(20)14-19(15)16-7-5-4-6-8-16/h4-8,12-13,20H,9-11,14H2,1-3H3
charge 0 multiplicity 1
50 atoms
O  4.654501 -2.066825 0.352149
O  5.910676 0.536521 -0.160531
N  -0.572679 1.290588 -0.002662
C  0.154405 0.029537 0.288198
C  -0.407613 -1.051146 -0.665803
C  0.077646 2.496244 0.552509
C  1.672128 0.184814 0.164581
C  -1.992377 1.182863 0.38344
C  1.431801 2.70562 -0.14415
C  2.284293 1.449926 -0.047794
C  -1.928473 -1.113737 -0.652846
C  -2.668166 -0.085274 -0.133545
C  2.495903 -0.958987 0.308732
C  3.693457 1.52753 -0.161775
C  -2.509957 -2.360264 -1.294142
C  -4.158393 -0.110303 0.003706
C  3.897202 -0.875863 0.215317
C  4.505845 0.383075 -0.057042
C  -4.815171 -1.191124 0.656303
C  -4.961161 0.961999 -0.476936
C  -6.2184 -1.20768 0.811641
C  -6.365094 0.946786 -0.326594
C  -7.00189 -0.138016 0.320006
C  5.568682 -2.076009 1.517761
C  6.521772 -0.188528 -1.298628
H  -0.066365 -0.303615 1.340308
H  -0.007566 -2.047667 -0.388627
H  -0.0448 -0.842553 -1.692514
H  0.225612 2.422509 1.661084
H  -0.585336 3.361691 0.365963
H  -2.522333 2.070376 -0.014084
H  -2.12267 1.221712 1.500099
H  1.965698 3.564084 0.306257
H  1.242334 2.954449 -1.206599
H  2.063776 -1.944634 0.513464
H  4.185213 2.490664 -0.339876
H  -2.016695 -2.544248 -2.269252
H  -3.595259 -2.284623 -1.466253
H  -2.321969 -3.260549 -0.674522
H  -4.211558 -2.011982 1.059945
H  -4.487215 1.801238 -0.999582
H  -6.698789 -2.049912 1.322855
H  -6.962204 1.778711 -0.717382
H  -8.090939 -0.147984 0.440844
H  4.986262 -2.027487 2.457761
H  6.27614 -1.22817 1.472527
H  6.108428 -3.033801 1.460629
H  6.146692 0.222126 -2.255505
H  6.300626 -1.269795 -1.243556
H  7.604682 -0.00989 -1.213275
