program: Gaussian 09
title: 000281811
version: EM64L-G09RevD.01
frameworkgroup: C1[X(C9H12N6O3)]
method: RPBEPBE
basis: SDD
operation: Freq
keyword: #p
keyword: freq=noraman
keyword: PBEPBE/SDD
title: #p freq=noraman PBEPBE/SDD
converged: YES YES NO NO
title: Mulliken charges:
elementType: O O O N N N N N N C C C C C C C C C H H H H H H H H H H H H
charge: -0.260124 -0.469201 -0.436615 -0.163865 -0.075070 -0.106516 -0.133413 -0.103407 -0.613667 -0.081685 -0.136159 -0.504869 -0.044616 -0.385258 0.141821 -0.213117 -0.092764 0.185169 0.291235 0.264963 0.252976 0.254456 0.251567 0.220506 0.225192 0.353485 0.335239 0.357008 0.346565 0.340165
chargesum: 0.00000
title: Mulliken charges with hydrogens summed into heavy atoms:
elementType: O O O N N N N N N C C C C C C C C C
charge: -0.260124 -0.115716 -0.079607 -0.163865 -0.075070 -0.106516 -0.133413 -0.103407 0.073062 0.209550 0.128804 0.002564 0.206952 0.060440 0.141821 0.122122 -0.092764 0.185169
polarizability: 2.09901760e+02 2.33018378e+00 1.42294987e+02 9.10145041e+00 -1.02325531e+01 9.46479730e+01
1716.lowfreq: -6.8117 -3.1900 0.0003 0.0006 0.0007 8.6129 26.9102 46.0807 56.6943
frequency: 26.3313 45.8552 56.5996 94.2648 116.1038 135.3138 153.7190 173.7706 211.7835 255.5449 269.8670 284.3662 288.5015 329.4472 368.7827 390.3125 432.3999 473.7551 506.9558 513.9684 526.2065 548.4089 570.2924 582.0555 636.4622 644.1200 656.8682 667.8769 675.5328 692.2245 785.0322 785.7823 814.3326 838.1845 868.5002 877.2098 905.4868 920.4324 943.1228 944.7479 962.0054 969.1769 1007.7690 1029.7347 1044.7055 1051.4568 1074.6590 1086.0456 1159.8469 1163.7849 1174.1625 1182.8694 1203.2872 1229.9277 1249.4143 1266.2536 1288.5274 1298.2590 1307.7870 1317.2676 1335.9072 1345.0777 1367.7329 1383.2997 1387.9976 1417.3201 1445.8090 1457.0949 1460.2120 1490.6131 1585.3437 1641.2074 2990.9004 3015.9900 3024.1074 3038.8574 3081.0923 3087.6031 3102.8009 3203.5807 3534.5465 3544.1006 3578.1669 3688.0485
redmass: 5.1747 6.6053 5.9620 5.3012 4.8171 5.9893 6.6157 6.6533 5.3864 3.3832 4.3549 3.1510 4.5311 1.2664 2.8974 2.4369 3.1323 1.4691 8.2555 1.1445 5.4350 1.2258 5.4414 5.5100 5.1054 6.9821 6.5964 6.3309 6.9578 6.9707 7.3211 6.8834 2.9645 3.4232 8.0052 3.3720 1.3044 2.9109 3.1634 3.9123 4.8427 5.0918 2.9164 2.5851 3.5771 3.0180 4.7949 1.7241 1.4407 2.1150 1.2891 1.2777 1.8942 2.2416 1.7667 1.3740 2.9962 1.5802 1.3653 1.3838 1.2967 6.5749 1.3298 3.2340 1.5618 1.3755 1.1058 4.2307 1.0816 7.2301 1.5039 3.7859 1.0660 1.0846 1.0793 1.0691 1.0892 1.0992 1.1040 1.1022 1.0442 1.0652 1.0664 1.1055
irintensity: 0.5536 1.5283 1.4784 18.7340 10.4786 1.3594 4.1584 2.9592 5.3032 0.1287 4.7020 8.0818 2.0479 155.1446 29.3240 10.0245 65.6988 173.4003 2.3816 183.8733 15.3030 56.0630 17.8782 19.0181 31.2949 42.2311 18.1449 5.7888 18.7813 3.0303 10.4893 22.0623 19.1512 33.2640 3.6589 49.6663 16.6636 22.3516 36.3949 113.5422 64.6705 71.7029 15.2005 135.8280 31.0129 13.3795 59.7822 20.4959 23.7621 0.7576 15.8190 73.6142 43.7600 98.5858 80.4025 12.0292 10.4633 3.2294 0.8210 0.7614 30.7365 88.9799 9.9033 58.0099 1.3115 14.8698 15.6707 38.9496 6.8008 9.2676 4.7606 487.7274 37.0824 34.4779 13.6057 19.7937 3.6839 20.7227 12.3398 61.2114 133.5460 6.5368 10.3044 50.5600
temp: 298.150 k
press: 1.00000 atm
elementType: 8 8 8 7 7 7 7 7 7 6 6 6 6 6 6 6 6 6 1 1 1 1 1 1 1 1 1 1 1 1
symmnumber: 1
zpe: 593855.4 jmol-1
zpe.correction: 0.226188 hartree
zpe.thermalcorrener: 0.241950 hartree
zpe.thermalcorrenthalpy: 0.242894 hartree
zpe.thermalcorrgfe: 0.182230 hartree
zpe.sumelectzpe: -902.925029 hartree
zpe.sumelectthermal: -902.909266 hartree
zpe.sumelectthermalent: -902.908322 hartree
zpe.sumelectthermalfe: -902.968986 hartree
dipole: 3.2088 5.6003 1.1609
dipole: 6.5580
quadrupole: -102.7924 -114.1507 -98.5267
quadrupole: -11.3853 9.1894 4.1836
quadrupole: 2.3642 -8.9941 6.6299 -11.3853 9.1894 4.1836
hfenergy: -903.1512162 hartree
pointgroup: C01 [X(C9H12N6O3)]
dipole: 1.1934125 -2.259296 -0.3583877 debye
polarizability: 208.9878713|-5.0845797|141.0456525|-12.9273892|-12.7011539|96.8111955 unknown
InChI: InChI=1S/C9H12N6O3/c10-8-7-9(13-14-12-8)15(3-11-7)6-1-4(17)5(2-16)18-6/h3-6,16-17H,1-2,10H2
charge 0 multiplicity 1
30 atoms
O  1.981656 0.915228 0.455194
O  2.658968 -2.31423 -0.443272
O  4.748518 1.45948 -0.019954
N  -0.092467 -0.087928 -0.349133
N  -1.56005 -1.678531 0.430235
N  -1.665927 1.819622 -0.612289
N  -3.929433 1.252625 0.012168
N  -2.998658 2.155994 -0.453259
N  -4.583889 -0.873705 0.793133
C  1.149716 0.61948 -0.719573
C  3.069101 -0.923709 -0.732064
C  2.08406 -0.169157 -1.665435
C  3.001217 -0.1649 0.619209
C  4.303783 0.531613 1.024327
C  -1.348508 0.532328 -0.276325
C  -0.281843 -1.411117 0.093322
C  -2.235279 -0.465161 0.199848
C  -3.585912 -0.057092 0.344659
H  0.818618 1.59255 -1.116441
H  4.092509 -0.907785 -1.14939
H  2.646447 0.558837 -2.27408
H  1.533848 -0.843533 -2.34195
H  2.671898 -0.871468 1.405741
H  5.111631 -0.210771 1.135002
H  4.159138 1.054986 1.990579
H  2.863248 -2.88978 -1.222113
H  0.547801 -2.116516 0.135882
H  4.040971 2.149683 -0.110765
H  -4.38179 -1.836546 1.053819
H  -5.52737 -0.496898 0.868824
