program: Gaussian 09
title: 000281813
version: EM64L-G09RevD.01
frameworkgroup: C1[X(C11H13ClN4O2)]
method: RPBEPBE
basis: SDD
operation: Freq
keyword: #p
keyword: freq=noraman
keyword: PBEPBE/SDD
title: #p freq=noraman PBEPBE/SDD
converged: YES YES NO NO
title: Mulliken charges:
elementType: Cl O O N N N N C C C C C C C C C C C H H H H H H H H H H H H H
charge: 0.027488 -0.425415 -0.432675 -0.202576 -0.032080 -0.026330 0.062852 -0.046685 -0.094745 -0.504459 -0.161913 -0.472982 -0.401303 0.120316 -0.212115 0.114519 -0.302444 -0.361357 0.235611 0.219813 0.233482 0.250248 0.257533 0.261296 0.229879 0.200466 0.246502 0.347787 0.278034 0.332629 0.258624
chargesum: 0.00000
title: Mulliken charges with hydrogens summed into heavy atoms:
elementType: Cl O O N N N N C C C C C C C C C C C
charge: 0.027488 -0.077628 -0.100046 -0.202576 -0.032080 -0.026330 0.062852 0.188926 0.125068 -0.020729 0.095620 0.018193 0.045665 0.120316 0.065919 0.114519 -0.302444 -0.102733
polarizability: 2.16267732e+02 2.94768437e+00 1.58491610e+02 4.16321072e+00 1.21107061e+01 1.00499534e+02
1716.lowfreq: -8.3824 0.0010 0.0017 0.0019 1.9096 10.8524 19.9215 31.2110 53.1981
frequency: 18.2033 30.8419 53.1556 89.9747 113.4302 126.0028 136.7030 181.7595 202.7634 226.3043 247.8028 264.5013 279.7962 308.5612 321.9714 362.5751 371.7481 384.8665 430.8296 484.8284 513.3748 544.0951 557.0385 568.3510 626.7591 642.9135 654.3392 662.9551 746.4347 789.8786 800.3912 825.1943 846.7494 873.8979 887.3261 899.2972 915.7909 944.7075 965.6598 976.6371 1011.9881 1029.4009 1049.8399 1077.1087 1099.8544 1104.8236 1116.0536 1133.4818 1164.4939 1180.9713 1193.8774 1206.5451 1240.9693 1248.2940 1267.7498 1278.6391 1280.4011 1286.7434 1299.9297 1304.2798 1310.0438 1328.1357 1346.2730 1362.6088 1373.6888 1383.8102 1391.9492 1401.6715 1446.7027 1468.9033 1476.3990 1477.5674 1501.8052 1560.9939 2952.7569 2992.2927 2998.4396 3014.2185 3018.3445 3027.0872 3073.3786 3078.2582 3092.8955 3185.9989 3230.1121 3556.1718 3571.1706
redmass: 5.9844 8.1902 5.7824 4.5723 7.5786 4.1700 2.7712 8.5739 7.0342 3.3957 3.4908 1.2541 4.8736 1.2956 3.6932 3.7580 3.1139 5.3024 4.4665 2.9992 4.2626 4.8341 6.2486 5.9495 6.8268 4.4670 4.7850 4.9972 3.5093 6.9302 7.0242 3.1667 1.5162 3.3473 1.6497 5.9579 1.4312 1.8309 3.2555 2.2492 3.5952 2.6152 1.9794 2.4476 3.4628 3.0490 1.4163 2.7015 2.8806 1.4630 1.9993 1.6632 1.5174 1.4442 1.8185 1.3399 1.3498 5.0620 2.1831 1.4906 1.7684 1.4215 1.4025 5.0716 1.2471 1.5231 1.3914 2.0129 3.9941 1.0836 1.0829 1.0926 7.5392 9.9812 1.0687 1.0809 1.0847 1.0641 1.0681 1.0846 1.0995 1.1005 1.1005 1.0929 1.0987 1.0662 1.0665
irintensity: 0.1004 0.4936 0.5522 4.5272 0.8975 3.7146 2.8540 0.6201 4.5931 7.0492 27.0680 111.8852 1.9728 106.5698 20.9501 21.9378 10.4144 15.2149 11.2575 10.0638 8.5546 1.6586 10.6240 6.6537 4.9343 12.8292 4.3130 6.4459 10.6611 4.7470 44.1891 4.2219 11.3482 18.5042 7.6991 70.7224 12.0004 16.6308 109.0120 18.3202 63.0346 43.9846 20.8496 11.5662 44.9771 3.6387 6.4004 13.3671 92.8490 7.7030 55.7054 14.2691 14.6953 2.6887 7.2151 3.5214 24.4693 47.1780 39.2830 14.4370 33.4438 9.2269 11.1914 29.3065 6.4258 28.4164 24.6788 30.7167 109.6582 17.8926 6.1512 0.2813 141.7374 70.7587 55.5502 26.7483 4.5386 32.8004 20.2323 22.0081 7.9011 40.0977 10.9565 6.7458 0.2631 6.1620 7.9044
temp: 298.150 k
press: 1.00000 atm
elementType: 17 8 8 7 7 7 7 6 6 6 6 6 6 6 6 6 6 6 1 1 1 1 1 1 1 1 1 1 1 1 1
symmnumber: 1
zpe: 622509.9 jmol-1
zpe.correction: 0.237102 hartree
zpe.thermalcorrener: 0.253304 hartree
zpe.thermalcorrenthalpy: 0.254248 hartree
zpe.thermalcorrgfe: 0.191565 hartree
zpe.sumelectzpe: -1255.126458 hartree
zpe.sumelectthermal: -1255.110256 hartree
zpe.sumelectthermalent: -1255.109311 hartree
zpe.sumelectthermalfe: -1255.171995 hartree
dipole: -4.5325 -1.4047 -2.5182
dipole: 5.3720
quadrupole: -127.9645 -116.7037 -109.7103
quadrupole: 0.4731 13.7138 -1.3356
quadrupole: -9.8384 1.4225 8.4159 0.4731 13.7138 -1.3356
hfenergy: -1255.3635598 hartree
pointgroup: C01 [X(C11H13Cl1N4O2)]
dipole: -1.7933422 0.6860606 0.8832709 debye
polarizability: 216.2406937|-4.511475|160.5274234|-0.8495206|5.7091305|98.4907588 unknown
InChI: InChI=1S/C11H13ClN4O2/c12-10-9-11(14-4-13-10)16(5-15-9)7-1-6(3-17)2-8(7)18/h4-8,17-18H,1-3H2
charge 0 multiplicity 1
31 atoms
Cl 5.109388 -0.427113 0.08288
O  -1.737985 1.972166 -2.043834
O  -4.427132 -2.105482 -0.17882
N  0.295621 1.108918 0.302012
N  2.524781 1.703968 0.40657
N  0.559665 -1.33031 -0.097561
N  2.911206 -1.996796 -0.189781
C  -1.174126 1.260967 0.298122
C  -3.245026 -0.068813 0.692594
C  -1.914005 0.411383 1.373792
C  -1.836122 0.889425 -1.06372
C  -3.30514 0.671511 -0.673375
C  -3.234059 -1.606498 0.519742
C  1.02322 -0.068344 0.114263
C  1.249322 2.127371 0.467427
C  2.409543 0.323129 0.186083
C  3.327729 -0.737356 0.019374
C  1.560331 -2.244865 -0.241478
H  -1.371169 2.338605 0.454316
H  -4.121696 0.20302 1.312567
H  -2.102069 1.008501 2.282109
H  -1.29824 -0.455989 1.671295
H  -1.384769 -0.045123 -1.453033
H  -3.863232 0.094517 -1.42822
H  -3.786184 1.663121 -0.575251
H  -3.122773 -2.092966 1.513067
H  -2.3856 -1.920367 -0.11148
H  -0.86314 1.929825 -2.505128
H  0.949924 3.16116 0.631231
H  -5.22661 -1.925587 0.378158
H  1.265647 -3.28248 -0.41512
