program: Gaussian 09
title: 000281822
version: EM64L-G09RevD.01
frameworkgroup: C1[X(C17H22N4O5)]
method: RPBEPBE
basis: SDD
operation: Freq
keyword: #p
keyword: freq=noraman
keyword: PBEPBE/SDD
title: #p freq=noraman PBEPBE/SDD
converged: NO YES NO NO
title: Mulliken charges:
elementType: O O O O O N N N N C C C C C C C C C C C C C C C C C H H H H H H H H H H H H H H H H H H H H H H
charge: -0.266757 -0.294310 -0.248670 -0.270199 -0.302439 -0.389754 -0.215365 -0.388252 -0.621696 -0.297501 0.283216 -0.198715 -0.388205 -0.265040 0.150068 0.254409 -0.355725 -0.089649 -0.248798 -0.529296 0.272508 0.202420 -0.832140 0.312903 -0.319159 -0.709425 0.307434 0.264064 0.265042 0.253120 0.249199 0.297271 0.262857 0.244952 0.221423 0.267112 0.219377 0.225186 0.219383 0.286067 0.349797 0.237299 0.222130 0.341832 0.339770 0.221932 0.233477 0.226847
chargesum: 0.00000
title: Mulliken charges with hydrogens summed into heavy atoms:
elementType: O O O O O N N N N C C C C C C C C C C C C C C C C C
charge: -0.266757 -0.294310 -0.248670 -0.270199 -0.302439 -0.124712 -0.215365 -0.038455 0.059906 0.009933 0.283216 0.065349 0.114114 0.032232 0.150068 0.254409 0.152083 -0.089649 -0.248798 0.178616 0.272508 0.202420 -0.101504 0.312903 0.140270 -0.027169
polarizability: 3.13575696e+02 -3.66451783e+01 1.99820342e+02 1.32945570e+01 -2.58964818e+01 2.03153271e+02
1716.lowfreq: -8.4826 -6.3184 -1.5899 0.0005 0.0005 0.0006 18.6696 32.6877 39.1393
frequency: 18.5586 32.6705 39.1218 53.8570 68.5221 71.9632 76.6651 91.6990 101.7999 106.0119 116.4057 138.4409 144.7202 151.9665 166.6690 184.4763 193.2289 199.6149 212.4602 248.0638 257.0803 262.4595 294.5863 302.0097 306.7156 340.0207 346.0793 364.6075 382.6067 411.6930 423.8859 443.9395 449.0678 472.9282 501.2546 503.7104 526.1456 539.9491 549.3069 577.0110 604.8530 611.4776 630.2155 690.4424 698.0552 709.7077 738.1851 743.8000 754.6178 770.5961 785.7556 798.1170 798.9733 804.3897 815.6088 859.5077 874.0862 896.9180 929.0599 939.2206 947.7593 949.7619 979.2125 997.9604 1007.3378 1023.1708 1038.1232 1038.6292 1053.1448 1058.3005 1070.7106 1085.6801 1100.8482 1113.6789 1116.6368 1127.2832 1138.7299 1154.1660 1157.5273 1174.8023 1182.4382 1195.3371 1201.4739 1207.6822 1262.9188 1268.2875 1274.5295 1289.5704 1303.6250 1307.5156 1315.4726 1341.0433 1354.9991 1370.8825 1384.0616 1390.4722 1391.6142 1398.2613 1416.0261 1444.4444 1450.1057 1464.3229 1472.2238 1472.6160 1475.0397 1480.0191 1485.7239 1491.8610 1495.4597 1501.7822 1511.3189 1564.7543 1585.5003 1594.4865 1611.1459 1675.3534 2964.5154 2977.5177 2978.5995 2987.7166 3021.6999 3028.1639 3034.5170 3054.4475 3064.0009 3083.3451 3088.1834 3094.0438 3096.5250 3097.2758 3099.8732 3121.8564 3145.5876 3159.9916 3311.2963 3345.7110 3554.4313 3713.2134
redmass: 3.9131 5.9601 4.6446 4.4149 2.2832 4.7005 5.0276 3.9209 3.1564 4.6539 1.9273 4.0564 3.4420 3.0580 2.8151 1.0502 3.3776 6.0195 5.0728 5.0300 1.3106 4.2981 3.5619 3.4855 4.0343 3.6769 3.9526 3.6525 3.3530 6.4947 4.7398 4.6706 4.5890 7.2604 1.1719 4.5624 1.2121 3.8186 5.2690 5.5013 6.6071 4.4663 5.4053 4.8258 10.8673 5.4162 8.5544 5.2145 4.7777 1.4197 2.7311 3.4157 4.4638 1.2909 4.5955 2.1841 1.5302 2.6244 3.0439 3.5835 2.7191 2.2748 2.7627 2.2858 4.5792 3.7671 1.5436 2.1363 2.3645 2.0613 3.0352 1.5568 2.8314 1.3899 1.6743 1.6527 1.5223 2.2542 1.8509 1.9701 1.8727 1.4327 1.5677 1.4864 1.1611 1.3353 1.6593 2.5100 2.4895 1.5123 2.8841 1.7638 1.8220 2.3885 2.3063 1.5933 1.5346 1.2441 1.1437 1.8425 1.4773 1.1331 1.1614 1.1163 1.0693 1.0954 1.9058 1.2466 1.0534 1.5125 1.9617 6.9574 1.2318 5.4758 8.4427 6.5942 1.0647 1.0324 1.0438 1.0365 1.0627 1.0621 1.0780 1.0921 1.0944 1.0983 1.0995 1.0987 1.1080 1.0999 1.1026 1.1056 1.0904 1.0954 1.0748 1.0772 1.0446 1.1057
irintensity: 1.6303 0.1249 1.0952 1.6389 3.5884 1.3803 3.2791 4.9807 11.8143 1.5703 3.2570 0.2110 0.9839 1.8021 4.7605 0.0787 14.9055 1.8649 1.1449 4.6458 0.2480 0.3487 9.0846 5.6828 8.2367 7.0203 7.2495 9.7709 9.8240 41.2144 0.6735 18.5381 10.3592 2.1763 222.5457 11.9849 41.3839 11.7104 16.4054 3.9484 14.2648 5.3971 1.1120 33.9598 42.1935 9.4213 3.1494 5.0675 3.9484 57.2056 15.8720 32.5290 23.9183 16.2175 5.0482 2.4162 9.6376 18.5915 29.4083 19.6152 9.4514 5.9486 37.1929 10.5718 66.2375 228.0338 8.6900 17.1681 44.2131 5.5040 11.5753 5.1729 54.8223 10.6442 12.0695 6.9355 15.5519 12.5781 5.2751 34.3820 1.6301 13.4614 34.3308 30.5396 8.1078 1.6313 40.0105 17.5162 275.6064 0.5838 152.0549 9.8576 31.5268 71.1821 92.1445 5.7145 47.7942 32.8720 22.4911 152.0166 123.9070 18.3685 32.1807 6.3656 20.8900 99.7132 207.4171 2.9686 13.2253 92.1015 267.0928 36.7732 101.0789 374.8371 6.4224 311.6703 20.4573 55.0149 65.0195 28.4375 9.3221 21.6675 8.4785 5.3074 15.9917 42.2726 49.4054 4.1481 3.4363 35.4352 5.5443 9.3979 13.5682 2.9822 83.1808 3.5712 59.2087 51.9224
temp: 298.150 k
press: 1.00000 atm
elementType: 8 8 8 8 8 7 7 7 7 6 6 6 6 6 6 6 6 6 6 6 6 6 6 6 6 6 1 1 1 1 1 1 1 1 1 1 1 1 1 1 1 1 1 1 1 1 1 1
symmnumber: 1
zpe: 999563.1 jmol-1
zpe.correction: 0.380713 hartree
zpe.thermalcorrener: 0.406500 hartree
zpe.thermalcorrenthalpy: 0.407444 hartree
zpe.thermalcorrgfe: 0.324286 hartree
zpe.sumelectzpe: -1254.137363 hartree
zpe.sumelectthermal: -1254.111576 hartree
zpe.sumelectthermalent: -1254.110632 hartree
zpe.sumelectthermalfe: -1254.193791 hartree
dipole: -1.3252 1.6439 3.1381
dipole: 3.7823
quadrupole: -122.3136 -157.9485 -151.5426
quadrupole: -4.6831 8.6619 15.2416
quadrupole: 21.6213 -14.0136 -7.6077 -4.6831 8.6619 15.2416
hfenergy: -1254.5180762 hartree
pointgroup: C01 [X(C17H22N4O5)]
dipole: -0.5787885 -0.4234372 -1.3038769 debye
polarizability: 319.5258598|27.1063538|200.5775407|-12.0129|-24.8231103|196.4459085 unknown
InChI: InChI=1S/C17H22N4O5/c1-4-19-11-7(2)13(22)12-10(14(11)23)8(6-26-16(18)24)17(25-3)15-9(20-15)5-21(12)17/h8-9,15,19-20H,4-6,18H2,1-3H3
charge 0 multiplicity 1
48 atoms
O  2.103294 0.869596 2.312501
O  1.116512 -2.448258 -0.576263
O  -0.57301 2.281065 -1.814574
O  -2.130236 -1.731317 1.635878
O  3.28178 -3.405487 -0.600699
N  4.3038 0.830476 0.212958
N  1.316715 0.983821 -0.031549
N  -4.020245 -0.438359 0.388123
N  2.020174 -3.086349 -2.552874
C  3.283789 -0.293394 0.390852
C  1.967036 0.14431 1.046106
C  3.4220 0.404187 -0.950344
C  2.222973 1.342657 -1.155521
C  0.882073 -0.941154 1.393991
C  -0.029492 0.71052 -0.075599
C  -0.372841 -0.32189 0.791136
C  1.112933 -2.38374 0.911077
C  -1.009561 1.40582 -0.973564
C  -1.725652 -0.742115 0.911485
C  2.537901 2.282446 2.263924
C  -2.41364 1.037026 -0.841145
C  -2.774966 0.036547 0.079869
C  -3.376095 1.786625 -1.750494
C  2.238777 -3.023373 -1.194099
C  -5.354007 -0.041279 -0.089017
C  -6.433665 -0.581946 0.865597
H  3.645885 -1.313622 0.538914
H  3.866326 -0.100523 -1.812993
H  5.257413 0.427542 0.130872
H  2.529618 2.401257 -1.098164
H  1.707059 1.181772 -2.114879
H  0.832718 -0.983364 2.497452
H  0.262907 -3.005079 1.238338
H  2.060406 -2.80726 1.288314
H  1.824953 2.886128 1.670421
H  3.549716 2.370267 1.839185
H  2.513604 2.610416 3.315417
H  -3.937676 2.574871 -1.213379
H  -4.103541 1.121004 -2.244806
H  -2.784639 2.293871 -2.530717
H  -3.96306 -1.227492 1.058784
H  -5.415967 1.058423 -0.145571
H  -5.532492 -0.434078 -1.110844
H  1.128134 -2.789895 -2.942342
H  2.733258 -3.504808 -3.143184
H  -6.396892 -1.685472 0.927613
H  -6.303863 -0.172668 1.883099
H  -7.437316 -0.298423 0.504215
