program: Gaussian 09
title: 000281792
version: EM64L-G09RevD.01
frameworkgroup: C1[X(C12H16N2)]
method: RPBEPBE
basis: SDD
operation: Freq
keyword: #pfreq=noraman
keyword: PBEPBE/SDD
title: #p freq=noraman PBEPBE/SDD
converged: NO YES NO NO
title: Mulliken charges:
elementType: N N C C C C C C C C C C C C H H H H H H H H H H H H H H H H
charge: -0.476333 -0.706721 0.219342 -0.414537 0.283351 0.344059 0.237880 -0.698433 -0.696983 -0.657562 -0.384748 -0.825733 0.582922 -0.525259 0.272825 0.226408 0.201266 0.239959 0.208128 0.239736 0.201171 0.208255 0.202888 0.228364 0.224548 0.226055 0.226362 0.211019 0.298847 0.302924
chargesum: 0.00000
title: Mulliken charges with hydrogens summed into heavy atoms:
elementType: N N C C C C C C C C C C C C
charge: -0.203508 -0.104950 0.219342 -0.188129 0.283351 0.344059 0.237880 -0.049080 -0.047821 -0.454674 -0.156384 -0.148768 0.582922 -0.314241
polarizability: 2.30303082e+02 -3.78555760e-01 1.52444337e+02 -9.01822954e-02 1.11454239e-01 8.38387461e+01
1716.lowfreq: -22.8039 -0.0004 -0.0002 0.0004 6.0043 8.1058 15.0186 91.7030 134.0713
frequency: -22.5133 91.6933 134.0554 190.4199 211.8643 213.3022 217.1468 250.6725 262.5232 281.8659 293.4920 319.3535 348.2334 355.2383 361.9443 424.5428 446.1414 447.4182 459.4245 496.5148 498.5525 526.6772 560.8801 636.4771 654.0479 696.1486 737.3592 766.0433 782.1897 807.7640 830.9559 846.0225 897.9692 904.0800 923.6075 925.2667 987.7646 988.3120 1014.9290 1037.5233 1044.0303 1073.1582 1140.3098 1155.7412 1166.9754 1219.6742 1247.0689 1277.6729 1288.9988 1344.0999 1361.9896 1363.2503 1380.6278 1394.7162 1403.6723 1426.3901 1454.7487 1457.7152 1466.2072 1470.3123 1477.1642 1479.8567 1498.0257 1531.7369 1576.2665 1634.4955 1640.3946 1662.6920 2964.9505 2969.0385 2970.2461 3044.9329 3058.1413 3065.7274 3085.0324 3092.0837 3096.3650 3100.8983 3114.5516 3123.0946 3148.1815 3538.6685 3569.8427 3711.4720
redmass: 3.3853 3.6237 2.7393 3.4283 2.3479 1.1784 1.0504 1.1899 3.4696 2.1713 2.7994 1.2784 2.2028 3.0237 1.0899 1.8041 2.2027 4.1890 4.4068 2.7547 2.0691 4.5320 3.5710 2.8027 5.3856 4.7885 2.5368 5.2416 1.5206 1.3593 2.0753 4.4642 1.5780 1.8306 2.5373 1.3515 1.5115 1.5604 2.1869 1.5632 1.5284 2.0379 1.6371 3.6007 1.5443 1.6954 1.9943 2.3528 1.7745 3.0285 2.2455 1.1985 1.2574 1.2807 5.7306 1.9479 1.0501 1.0511 1.0468 1.0868 1.0809 1.2572 2.6994 2.8876 5.3491 1.9914 1.9680 7.2411 1.0362 1.0367 1.0369 1.0972 1.0985 1.0979 1.0984 1.1004 1.0997 1.0903 1.0904 1.0864 1.0960 1.0756 1.0446 1.1040
irintensity: 0.1163 4.9730 2.0546 3.9677 0.9865 0.3370 1.0246 0.0825 0.0043 0.4496 0.1447 299.7932 3.1911 0.9908 0.5681 22.2367 31.2855 0.6707 7.0572 1.5649 50.1417 0.2234 0.2923 13.4577 0.0300 1.6855 0.2718 0.5450 16.6192 40.7013 69.0266 4.0486 0.0277 0.2836 4.1102 0.3986 1.6137 1.9273 2.1962 0.9702 6.3410 1.3506 1.0575 35.0000 84.1173 27.3247 5.8703 78.8951 3.4126 68.0941 61.6646 19.8515 47.3751 22.7544 29.9893 9.4127 2.1898 2.0208 13.8457 11.0414 10.4314 30.4699 64.3705 29.6018 48.5357 55.3062 565.4289 105.7069 17.3708 90.3933 12.0589 22.5064 1.5299 55.3231 28.3487 19.5405 43.1721 28.9072 20.5608 16.1277 24.2889 7.3579 79.8950 18.1415
temp: 298.150 k
press: 1.00000 atm
elementType: 7 7 6 6 6 6 6 6 6 6 6 6 6 6 1 1 1 1 1 1 1 1 1 1 1 1 1 1 1 1
symmnumber: 1
zpe: 664643.0 jmol-1
zpe.correction: 0.253149 hartree
zpe.thermalcorrener: 0.266306 hartree
zpe.thermalcorrenthalpy: 0.267250 hartree
zpe.thermalcorrgfe: 0.215549 hartree
zpe.sumelectzpe: -575.352567 hartree
zpe.sumelectthermal: -575.339410 hartree
zpe.sumelectthermalent: -575.338466 hartree
zpe.sumelectthermalfe: -575.390167 hartree
dipole: -0.7112 -1.9155 0.0068
dipole: 2.0433
quadrupole: -67.2497 -72.6932 -91.2667
quadrupole: 3.3793 -0.0123 0.0597
quadrupole: 9.8202 4.3767 -14.1968 3.3793 -0.0123 0.0597
hfenergy: -575.6057159 hartree
pointgroup: C01 [X(C12H16N2)]
dipole: 0.2890151 0.7501398 0.0022451 debye
polarizability: 230.2812444|-1.332639|152.4649211|0.3633603|-0.203987|83.8399988 unknown
InChI: InChI=1S/C12H16N2/c1-8-7-12(2,3)14-11-6-9(13)4-5-10(8)11/h4-7,14H,13H2,1-3H3
charge 0 multiplicity 1
30 atoms
N  -0.841612 1.340238 -0.018488
N  4.036596 1.234821 0.004929
C  -2.219157 0.787408 -0.004705
C  -2.162343 -0.733975 -0.00845
C  0.345291 0.61348 -0.007014
C  -1.015862 -1.481586 -0.003999
C  0.300646 -0.823722 0.000725
C  -2.985731 1.292242 -1.266305
C  -2.960706 1.285769 1.275086
C  1.592273 1.287644 -0.005415
C  1.531836 -1.523674 0.009699
C  -1.08606 -2.998686 -0.004307
C  2.812113 0.560057 0.00333
C  2.775283 -0.865927 0.011147
H  -0.769984 2.358998 -0.02408
H  -3.141393 -1.229397 -0.012132
H  -3.048207 2.398449 -1.27192
H  -2.46679 0.962642 -2.182301
H  -4.016969 0.893621 -1.282205
H  -2.421428 0.954296 2.178619
H  -3.025948 2.391786 1.285963
H  -3.990128 0.883793 1.311851
H  1.616013 2.38602 -0.010567
H  1.519128 -2.619367 0.015239
H  -2.133321 -3.345248 -0.008771
H  -0.588516 -3.424909 0.888062
H  -0.580585 -3.425011 -0.892132
H  3.709769 -1.438664 0.017851
H  4.07526 2.249189 -0.003008
H  4.910236 0.718017 0.013298
