program: Gaussian 09
title: 000281799
version: EM64L-G09RevD.01
frameworkgroup: C1[X(C10H17NO4)]
method: RPBEPBE
basis: SDD
operation: Freq
keyword: #p
keyword: freq=noraman
keyword: PBEPBE/SDD
title: #p freq=noraman PBEPBE/SDD
converged: YES YES NO NO
title: Mulliken charges:
elementType: O O O O N C C C C C C C C C C H H H H H H H H H H H H H H H H H
charge: -0.293929 -0.285938 -0.281110 -0.280650 -0.352687 -0.154382 -0.105681 -0.090531 0.350500 -0.322485 -0.397352 -0.689393 -0.678139 0.241520 -0.770824 0.250616 0.253201 0.247148 0.235250 0.210204 0.271018 0.251860 0.223813 0.232033 0.222842 0.224867 0.230253 0.226948 0.317179 0.251111 0.250876 0.211860
chargesum: 0.00000
title: Mulliken charges with hydrogens summed into heavy atoms:
elementType: O O O O N C C C C C C C C C C
charge: -0.293929 -0.285938 -0.281110 -0.280650 -0.035507 0.096234 0.147520 0.156618 0.350500 0.122969 0.125526 -0.010705 0.003928 0.241520 -0.056977
polarizability: 1.55659445e+02 1.88826255e+00 1.18483544e+02 -4.58099531e+00 3.64768855e+00 1.01215910e+02
1716.lowfreq: -12.4281 -9.9541 -4.2715 -0.0011 0.0002 0.0005 19.5630 34.3435 50.3301
frequency: 19.4534 34.0006 50.3117 58.5899 71.6809 89.1825 132.0029 153.5545 160.9544 222.8236 234.4221 274.9283 281.5786 311.5793 323.3248 362.7966 426.0818 460.5138 470.2462 475.3925 539.9196 583.5201 606.5546 646.2124 652.2207 671.0338 715.8029 752.1276 759.2090 793.0681 844.8307 880.2347 888.2353 921.3183 941.9468 967.5823 976.4421 983.3492 993.2970 1019.5576 1027.0578 1041.3441 1059.9400 1080.4106 1096.7801 1122.3882 1139.0420 1165.3257 1200.9660 1215.8876 1222.5128 1248.6583 1255.8927 1259.9520 1278.7510 1294.6850 1305.3235 1317.1860 1335.4320 1367.1614 1379.8454 1385.8448 1392.6227 1449.9110 1450.5109 1452.4716 1459.3077 1466.3229 1469.0707 1472.3032 1475.4475 1487.4468 1616.8479 2985.7260 2995.7520 2996.2082 3006.2609 3013.5551 3018.0471 3041.7107 3060.4845 3083.4705 3095.5565 3097.9575 3100.7684 3101.6644 3102.4855 3110.9162 3116.6685 3548.4822
redmass: 4.8010 3.6110 4.1335 3.8627 1.3696 2.3734 2.8388 2.5891 1.1854 1.2113 3.4751 2.7109 3.0828 3.2285 3.1651 3.2813 2.8519 3.1017 3.5593 3.5545 3.9399 2.9269 4.0057 5.5973 1.2201 3.2539 5.8748 3.2504 4.2350 4.1887 3.4699 3.5918 3.9028 1.5216 2.1659 4.2968 1.7802 1.3396 1.9472 3.1552 3.4174 1.6570 2.5339 3.1380 2.7095 3.0345 1.9634 1.2560 2.4917 1.2650 1.6214 1.3795 1.7394 2.5178 1.3563 1.3282 1.2987 1.2739 1.3276 1.4253 1.2893 1.2343 1.2298 1.0488 1.0483 1.0490 1.1147 1.0935 1.0666 1.0465 1.0889 1.9407 6.7360 1.0658 1.0359 1.0357 1.0356 1.0821 1.0640 1.0865 1.0881 1.1028 1.0993 1.1002 1.1013 1.1003 1.0994 1.0997 1.1006 1.0777
irintensity: 2.1387 3.2043 2.0298 7.6967 2.6533 1.6119 10.5697 2.3749 0.5679 1.0554 4.7326 1.8369 2.7653 3.2577 0.6986 4.7093 14.8191 3.1015 5.4534 26.0133 3.4034 27.6421 0.4294 0.6789 80.1585 4.6138 10.0173 24.1779 19.1672 11.8385 43.0293 6.4968 1.1689 1.9894 2.8199 65.3278 0.4907 4.4451 44.5845 23.6113 92.5801 9.7949 7.1267 52.3825 5.0000 20.1232 37.8298 1.8825 132.9669 22.3997 7.8782 4.2424 65.6268 38.2760 7.7395 12.3055 0.6331 6.7254 0.5926 0.4360 48.0558 62.8193 27.1733 1.2761 17.6083 3.2774 60.6982 41.7662 2.8633 18.2242 10.5708 230.8913 212.5918 45.5168 12.8216 9.3198 9.9021 12.9095 20.3418 33.7597 31.4928 10.4660 16.6521 24.8322 42.4759 1.9760 15.7737 25.9407 26.5407 32.5430
temp: 298.150 k
press: 1.00000 atm
elementType: 8 8 8 8 7 6 6 6 6 6 6 6 6 6 6 1 1 1 1 1 1 1 1 1 1 1 1 1 1 1 1 1
symmnumber: 1
zpe: 695139.5 jmol-1
zpe.correction: 0.264765 hartree
zpe.thermalcorrener: 0.280803 hartree
zpe.thermalcorrenthalpy: 0.281747 hartree
zpe.thermalcorrgfe: 0.219253 hartree
zpe.sumelectzpe: -745.711070 hartree
zpe.sumelectthermal: -745.695032 hartree
zpe.sumelectthermalent: -745.694088 hartree
zpe.sumelectthermalfe: -745.756582 hartree
dipole: -2.6876 2.4505 0.3756
dipole: 3.6564
quadrupole: -91.9164 -96.5890 -84.8249
quadrupole: 15.7878 6.2881 -2.2105
quadrupole: -0.8063 -5.4789 6.2852 15.7878 6.2881 -2.2105
hfenergy: -745.9758343 hartree
pointgroup: C01 [X(C10H17N1O4)]
dipole: -1.0459534 -0.980079 0.1218022 debye
polarizability: 156.016055|-0.5929351|119.2019154|2.1524133|-0.3913069|100.1409278 unknown
InChI: InChI=1S/C10H17NO4/c1-6(12)11-4-7-9-8(5-13-7)14-10(2,3)15-9/h7-9,11H,4-5H2,1-3H3
charge 0 multiplicity 1
32 atoms
O  -1.40937 0.908396 -0.148832
O  -3.006449 -0.813469 0.160278
O  0.514946 -1.807293 0.364744
O  3.81097 1.828343 -0.180119
N  2.642319 -0.153847 -0.537487
C  -0.907766 0.076857 0.968715
C  -1.76191 -1.218808 0.827366
C  0.557477 -0.351422 0.743674
C  -2.853736 0.616237 -0.286603
C  -0.865776 -2.12793 -0.048805
C  1.313668 0.435242 -0.34117
C  -3.218582 0.723823 -1.763676
C  -3.695117 1.506899 0.638388
C  3.81102 0.584009 -0.435558
C  5.101725 -0.200577 -0.662196
H  -1.050868 0.600822 1.931068
H  -2.015022 -1.681593 1.795349
H  1.128345 -0.316578 1.688554
H  -1.011481 -3.205022 0.125457
H  -1.038028 -1.890991 -1.117919
H  1.461166 1.487307 -0.040059
H  0.731099 0.428683 -1.279192
H  -3.068468 1.757684 -2.118685
H  -2.587011 0.044541 -2.358547
H  -4.276153 0.447141 -1.909998
H  -3.609356 2.563906 0.332517
H  -4.754695 1.203467 0.58768
H  -3.360534 1.412825 1.685885
H  2.675622 -1.162238 -0.700722
H  5.617332 0.204575 -1.550372
H  5.770873 -0.04842 0.201613
H  4.93996 -1.282969 -0.806849
