program: Gaussian 09
title: 000281778
version: EM64L-G09RevD.01
frameworkgroup: C1[X(C10H6Cl2N2O)]
method: RPBEPBE
basis: SDD
operation: Freq
keyword: #p
keyword: freq=noraman
keyword: PBEPBE/SDD
title: #p freq=noraman PBEPBE/SDD
converged: YES YES NO NO
title: Mulliken charges:
elementType: Cl Cl O N N C C C C C C C C C C H H H H H H
charge: -0.015075 -0.012745 -0.258298 -0.630884 -0.013740 0.555780 -0.292276 -0.278067 -0.285246 -0.234588 -0.225514 -0.205247 0.214249 0.173086 -0.267350 0.297821 0.266467 0.267025 0.247163 0.352157 0.345284
chargesum: 0.00000
title: Mulliken charges with hydrogens summed into heavy atoms:
elementType: Cl Cl O N N C C C C C C C C C C
charge: -0.015075 -0.012745 -0.258298 0.066556 -0.013740 0.555780 -0.292276 -0.278067 0.012575 0.031878 0.041512 0.041915 0.214249 0.173086 -0.267350
polarizability: 2.00098316e+02 4.15644842e+00 1.54704100e+02 -8.58636391e-01 -1.08775657e+01 8.47711915e+01
1716.lowfreq: -5.2334 -4.5941 -0.0035 -0.0030 -0.0019 6.2867 36.6363 51.9228 57.7497
frequency: 36.6315 51.9149 57.7392 79.2283 110.7099 149.0075 177.4547 191.1453 219.3574 241.5415 276.4565 323.0146 374.4690 388.1156 411.2529 465.6527 494.2370 507.7349 520.8322 544.7163 577.0655 579.8480 635.2515 647.3288 707.4495 727.5646 742.6012 776.7644 792.7607 838.1522 898.7822 932.0156 972.8705 1047.8957 1056.7348 1068.3945 1078.9694 1155.5191 1189.2897 1228.5818 1321.7585 1339.7753 1357.4453 1413.2642 1429.3475 1551.8311 1586.5801 1589.6991 1622.1067 1659.2927 2156.3817 3096.7475 3155.7380 3176.1636 3186.7781 3513.0829 3665.3868
redmass: 11.0576 7.4317 6.1325 10.8197 14.1804 9.8901 12.1795 4.6615 9.6713 8.9800 7.4037 4.6522 7.6785 8.5830 4.8399 4.6404 4.6870 6.3796 5.2429 1.5181 1.9817 4.0407 1.6763 4.9322 4.0200 6.2939 7.8489 1.4626 5.3509 5.3272 1.3590 1.5090 1.3419 4.2960 2.1303 3.3170 2.5047 1.4727 1.4961 2.0412 2.1929 3.7420 4.2522 2.3717 3.1837 6.5372 2.7740 4.1048 2.7127 4.5388 12.6107 1.0873 1.0878 1.0931 1.0997 1.0458 1.1042
irintensity: 0.8509 2.6795 6.5019 7.3775 0.3935 6.8061 3.0448 0.1791 3.1481 2.5361 5.0689 3.0286 12.9045 4.9311 6.9440 1.0351 2.0150 3.6303 4.8429 21.7970 123.6623 30.8150 117.2037 5.6606 13.5724 17.3077 81.1584 53.6505 10.7236 3.9139 0.0062 24.7776 0.8835 3.9171 6.7681 8.9150 4.8158 6.9514 16.7516 14.4008 91.1264 171.9872 2.6745 65.5906 22.7274 41.0493 72.0489 116.6699 38.7842 238.4948 15.8016 8.8777 3.4739 0.3316 4.5523 61.5215 53.4346
temp: 298.150 k
press: 1.00000 atm
elementType: 17 17 8 7 7 6 6 6 6 6 6 6 6 6 6 1 1 1 1 1 1
symmnumber: 1
zpe: 359456.5 jmol-1
zpe.correction: 0.136910 hartree
zpe.thermalcorrener: 0.151022 hartree
zpe.thermalcorrenthalpy: 0.151966 hartree
zpe.thermalcorrgfe: 0.094310 hartree
zpe.sumelectzpe: -1488.449007 hartree
zpe.sumelectthermal: -1488.434895 hartree
zpe.sumelectthermalent: -1488.433951 hartree
zpe.sumelectthermalfe: -1488.491606 hartree
dipole: 2.0259 -0.6123 0.3495
dipole: 2.1451
quadrupole: -70.6128 -107.4768 -109.3659
quadrupole: -0.0353 -2.7149 6.9645
quadrupole: 25.2057 -11.6583 -13.5474 -0.0353 -2.7149 6.9645
hfenergy: -1488.5859168 hartree
pointgroup: C01 [X(C10H6Cl2N2O1)]
dipole: -0.8224749 -0.0827451 -0.1700632 debye
dipolederiv: -0.1749777 -0.1829251 -0.0442923 -0.1135477 -0.6442335 -0.1552064 -0.0364267 -0.1618388 -0.0800974 -0.2025081 0.2644486 -0.0136776 0.1907617 -0.5769555 -0.0106712 -0.0097596 0.0086102 -0.0357936 -0.7667987 -0.078148 -0.179877 -0.0709642 -0.439499 -0.2462002 -0.1399458 -0.228261 -0.8824196 -1.0719364 0.1808856 0.3823753 0.1530471 -0.6295631 0.0506995 0.3394544 0.0527393 -0.56968 -0.2271193 0.0237165 0.0546408 0.0075666 -0.2316998 -0.0295557 0.0653395 -0.0276575 -0.3386787 -0.1311235 0.0000786 -0.0524195 0.0503988 -0.4301067 -0.0849803 -0.0990976 -0.085954 -0.002662 0.3086624 0.3432062 0.1263815 0.0977653 0.9438161 0.262 -0.0423194 0.2532783 0.0244976 0.3312061 -0.4408393 0.0618501 -0.1620203 0.8509825 -0.0193075 0.1912667 0.0184652 -0.0449299 0.5519617 -0.0546935 -0.1358233 -0.1904566 0.0097492 0.0795062 -0.1072116 0.0379447 0.0095547 -0.2095272 -0.2086472 -0.0361385 -0.1626729 -0.2384781 -0.0441007 -0.0316481 -0.0606347 -0.1231382 -0.2639641 0.2313312 0.0138512 0.1535092 -0.1842792 0.0300117 -0.023197 0.041678 -0.0871092 0.0913436 -0.0114751 0.0495915 -0.0148672 0.1920863 0.0543591 0.0436955 0.0527684 -0.1058189 -0.6707116 -0.0054358 0.0167066 0.0811757 0.0197889 -0.081668 -0.0363322 -0.0798175 -0.0737601 1.8385084 -0.0334366 -0.0443689 0.0797441 0.3944317 0.3809794 0.0575452 0.3539834 1.0525166 -0.1271897 -0.020459 -0.1073475 -0.0193543 0.1007668 0.0874979 -0.1154742 0.0615967 0.2614962 0.1324889 0.0014733 0.0037102 -0.0626707 0.104774 -0.0318914 0.0571304 -0.0126371 0.1080018 0.0575533 0.0469648 -0.0030421 0.0648071 0.0126634 -0.0209396 0.0012238 -0.0148102 0.1644592 0.0749128 -0.0257858 -0.0121761 -0.0470314 0.0008379 -0.0350696 -0.0367421 -0.0263799 0.1578182 -0.0719879 -0.0039527 -0.0393108 -0.0080939 0.0735987 -0.0164061 -0.0417041 -0.0234435 0.1497146 0.283551 -0.0142852 -0.0163653 -0.0218947 0.3322848 -0.0826665 -0.0437039 -0.076649 0.2104592 0.247656 -0.0120211 -0.0242684 -0.0052016 0.3390347 -0.0863906 0.0079067 -0.0829808 0.2055696 unknown
polarizability: 198.2678147|-9.133907|141.3134485|-3.5054958|31.3209149|99.9923435 unknown
InChI: InChI=1S/C10H6Cl2N2O/c11-8-2-1-3-9(12)7(8)4-6(5-13)10(14)15/h1-4H,14H2
charge 0 multiplicity 1
21 atoms
Cl -1.0330 2.893161 0.873066
Cl -0.566655 -2.634124 -0.019968
O  3.160651 0.736354 1.607303
N  4.080471 -0.176054 -0.324646
N  1.554943 -1.125203 -2.518836
C  -0.879763 0.149945 0.335236
C  -1.749305 1.275751 0.436163
C  -1.514048 -1.081586 -0.002597
C  0.552964 0.310864 0.64323
C  -3.129106 1.216753 0.182429
C  -2.894958 -1.180471 -0.259107
C  -3.700499 -0.024929 -0.174279
C  1.63281 -0.079568 -0.105836
C  3.018482 0.197313 0.471106
C  1.543364 -0.666652 -1.411907
H  0.813241 0.841985 1.571238
H  -3.740139 2.119722 0.258028
H  -3.330917 -2.150974 -0.509555
H  -4.77363 -0.093163 -0.376799
H  3.953444 -0.605169 -1.241488
H  5.02375 -0.008658 0.02342
