program: Gaussian 09
title: 000281769
version: EM64L-G09RevD.01
frameworkgroup: C1[X(C10H8OS)]
method: RPBEPBE
basis: SDD
operation: Freq
keyword: #p
keyword: freq=noraman
keyword: PBEPBE/SDD
title: #p freq=noraman PBEPBE/SDD
converged: NO YES NO NO
title: Mulliken charges:
elementType: S O C C C C C C C C C C H H H H H H H H
charge: 0.203750 -0.143169 -0.175812 -0.715467 0.152900 -0.246187 0.338711 -0.371184 -0.371565 -0.210105 -0.210188 -0.237435 0.287338 0.287465 0.247101 0.239278 0.239283 0.227781 0.227792 0.229712
chargesum: 0.00000
title: Mulliken charges with hydrogens summed into heavy atoms:
elementType: S O C C C C C C C C C C
charge: 0.203750 -0.143169 -0.175812 -0.140663 0.152900 0.000914 0.338711 -0.131906 -0.132282 0.017677 0.017603 -0.007723
polarizability: 1.82651120e+02 -8.13854993e+00 9.69024257e+01 2.52928317e-01 3.45137224e-01 9.54205373e+01
1716.lowfreq: -70.9218 -9.7485 -8.5064 -7.0302 -0.0017 -0.0010 0.0017 56.6430 59.2209
frequency: -70.9161 56.6069 59.2135 103.2786 182.4546 250.9385 255.5669 371.5761 394.8764 398.3156 480.5984 514.6442 562.7200 591.0548 614.2820 637.2561 698.8557 710.7010 764.4827 796.0666 820.6554 852.7310 882.9205 893.9534 936.6437 974.5944 987.3263 995.7749 1027.1501 1046.9884 1078.1817 1078.5537 1173.3013 1177.5436 1187.7633 1214.5110 1295.6520 1308.2650 1368.0174 1410.6814 1427.5675 1476.4856 1583.2683 1607.4988 1633.7910 1678.4687 3054.0995 3085.5414 3125.7664 3132.1161 3141.9746 3144.0884 3153.3191 3167.5454
redmass: 3.9377 5.3834 6.3802 3.6980 6.1144 8.1870 4.7958 3.1182 6.2940 2.8241 3.7911 15.2565 6.3858 2.3348 6.0237 4.9915 2.5936 2.2005 2.1311 5.9186 1.6514 1.2607 1.5009 2.2427 2.1535 1.3853 6.2006 1.3207 2.1797 1.2867 4.9443 1.6173 1.0521 1.3042 1.1178 2.2212 1.7726 1.3759 6.4425 1.0905 2.2224 2.3159 5.9616 6.2172 10.0275 12.3922 1.0556 1.0884 1.0844 1.0877 1.1097 1.0926 1.0970 1.1019
irintensity: 0.2788 2.9700 1.0981 6.2221 0.0907 0.7096 1.0410 1.2171 6.4763 0.2020 25.7451 4.6393 12.7804 1.6436 0.8563 12.9978 30.0970 19.2303 59.8410 11.5815 10.4844 1.0207 14.3858 9.3428 7.2751 0.1874 4.0726 0.2839 7.7467 0.4032 110.3126 11.2324 0.0248 25.8833 1.0065 0.2464 28.9140 0.1062 0.0023 11.8103 6.9471 12.5831 1.7586 6.2418 37.0510 132.6573 8.9499 13.1663 1.1499 0.3116 2.5284 16.2253 38.2059 21.6013
temp: 298.150 k
press: 1.00000 atm
elementType: 16 8 6 6 6 6 6 6 6 6 6 6 1 1 1 1 1 1 1 1
symmnumber: 1
zpe: 386191.8 jmol-1
zpe.correction: 0.147093 hartree
zpe.thermalcorrener: 0.156953 hartree
zpe.thermalcorrenthalpy: 0.157897 hartree
zpe.thermalcorrgfe: 0.110537 hartree
zpe.sumelectzpe: -858.264700 hartree
zpe.sumelectthermal: -858.254841 hartree
zpe.sumelectthermalent: -858.253896 hartree
zpe.sumelectthermalfe: -858.301256 hartree
dipole: 0.0629 -0.8814 0.0187
dipole: 0.8838
quadrupole: -66.9904 -81.8075 -71.4522
quadrupole: 3.0223 -0.0202 0.2673
quadrupole: 6.4263 -8.3908 1.9645 3.0223 -0.0202 0.2673
hfenergy: -858.4117931 hartree
pointgroup: C01 [X(C10H8O1S1)]
dipole: 0.0034467 0.3476957 -0.0006066 debye
dipolederiv: -0.7949412 0.0224239 -0.0001836 -0.1717686 -0.1469214 -0.0001857 0.000163 0.0000234 -0.0561647 -0.488832 -0.3320515 0.0003876 -0.0331655 -0.8808419 0.0001653 -0.0008551 -0.0017225 -0.2549275 0.7215274 0.3114926 0.0005595 0.6125626 -0.5036966 -0.0001159 0.0030774 -0.0003356 -0.1140858 -0.4125853 -0.0633402 0.0006218 -0.2570324 0.2860539 0.0003211 0.0002308 0.0002955 0.1174661 0.9395472 0.1435152 -0.0009565 -0.2613584 1.1093256 -0.0000531 -0.0004391 0.0015583 0.1696789 -0.0003198 -0.0943877 0.0004505 0.0993447 0.1325288 -0.000015 -0.000841 0.0001914 -0.1298782 0.2344961 0.020307 -0.0002174 0.1737096 -0.0394042 0.0003106 0.0017132 0.0003303 0.0183486 -0.1981578 0.0554267 -0.081774 -0.0282133 -0.1076972 -0.0098577 0.0517157 -0.0300971 0.060104 -0.1959275 0.0559652 0.0797343 -0.0327445 -0.1074895 0.0127525 -0.0538151 0.0325314 0.0607139 -0.0453519 0.0578755 0.0725975 0.0380713 -0.112581 0.0411567 0.0287725 0.0480806 0.0802131 -0.0464484 0.0575047 -0.0738573 0.0390558 -0.1142839 -0.0381452 -0.0311013 -0.0452965 0.0799337 0.0533496 0.108034 -0.0000445 0.0974859 -0.1126224 0.0007503 0.0008706 0.0010407 -0.0707191 0.0818973 -0.0001592 -0.0366595 0.0505807 0.0032869 0.0687686 -0.0772068 0.0557656 0.0120823 0.0825456 -0.0007743 0.0362279 0.0497012 0.0038952 -0.0687919 0.0770382 -0.0556456 0.0112797 -0.0181892 -0.0577576 0.0000463 -0.0971678 -0.0395118 -0.0004625 -0.0019122 -0.0007122 0.1503257 0.0741926 -0.0512038 0.092345 -0.024387 0.1196312 0.0285519 0.0825372 0.0236634 -0.0406404 0.0761448 -0.0522589 -0.0908673 -0.0253571 0.1192868 -0.0314588 -0.0814096 -0.0260979 -0.041471 0.0186116 -0.0393816 -0.0789027 -0.0588902 0.137145 -0.0373404 -0.0961674 -0.0365608 -0.0702427 0.0168275 -0.0387893 0.0805798 -0.0575795 0.138126 0.0342856 0.0977235 0.0336187 -0.069796 -0.0983866 -0.1024406 -0.0000874 -0.1128472 0.1157704 -0.0006363 -0.0000943 -0.0006311 0.0877792 unknown
polarizability: 181.3321795|13.329283|98.2074405|-0.088189|0.371722|95.4344632 unknown
InChI: InChI=1S/C10H8OS/c11-9-7-12-10(9)6-8-4-2-1-3-5-8/h1-6H,7H2
charge 0 multiplicity 1
20 atoms
S  3.489391 1.173672 0.007069
O  1.352894 -1.882749 -0.000008
C  1.713198 0.602149 0.005071
C  3.607625 -0.749212 0.001394
C  2.063203 -0.858515 0.003616
C  0.539095 1.289254 0.005676
C  -0.814897 0.649367 0.003608
C  -1.468574 0.354791 -1.220949
C  -1.479603 0.370675 1.225953
C  -2.761817 -0.21355 -1.221559
C  -2.772753 -0.197865 1.222265
C  -3.418126 -0.491137 -0.000733
H  4.087687 -1.144391 0.909052
H  4.08498 -1.139259 -0.909911
H  0.574161 2.388965 0.007683
H  -0.959579 0.562992 -2.168528
H  -0.979161 0.591092 2.175333
H  -3.25293 -0.443184 -2.173696
H  -3.272361 -0.415351 2.172838
H  -4.420433 -0.933443 -0.002374
