program: Gaussian 09
title: 000281781
version: EM64L-G09RevD.01
frameworkgroup: C1[X(C10H6N4O6)]
method: RPBEPBE
basis: SDD
operation: Freq
keyword: #p
keyword: freq=noraman
keyword: PBEPBE/SDD
title: #p freq=noraman PBEPBE/SDD
converged: YES YES NO NO
title: Mulliken charges:
elementType: O O O O O O N N N N C C C C C C C C C C H H H H H H
charge: -0.341213 -0.177174 -0.149718 -0.191267 -0.185471 -0.253542 0.014426 0.019899 -0.629065 0.000377 0.467119 -0.040868 0.345614 -0.558495 0.427914 -0.497287 -0.269502 0.170022 0.193023 -0.341196 0.302685 0.332073 0.280624 0.369922 0.356236 0.354863
chargesum: 0.00000
title: Mulliken charges with hydrogens summed into heavy atoms:
elementType: O O O O O O N N N N C C C C C C C C C C
charge: 0.028709 -0.177174 -0.149718 -0.191267 -0.185471 -0.253542 0.014426 0.019899 0.082035 0.000377 0.467119 -0.040868 0.345614 -0.255810 0.427914 -0.165214 0.011122 0.170022 0.193023 -0.341196
polarizability: 2.81151632e+02 -1.87372766e+01 2.06086421e+02 7.77077750e+00 -6.87708989e+00 7.14485000e+01
1716.lowfreq: -3.5300 -2.0504 -0.0008 -0.0006 0.0005 3.6062 16.9408 40.0019 51.2924
frequency: 16.9316 39.9961 51.2918 58.6729 65.0326 88.6070 113.7251 135.0942 145.8675 150.5334 183.4054 218.2653 250.2527 286.1058 305.0558 326.2774 334.7351 346.5853 397.6470 415.1414 438.6226 476.8437 497.4055 508.1952 532.9417 542.0034 568.7728 582.7386 592.9954 638.9437 652.4868 664.4027 691.2493 707.3057 737.4884 738.5129 766.0797 786.2325 809.1955 882.8597 944.2521 946.9692 953.4395 1005.8068 1049.0177 1077.8099 1094.1515 1109.5620 1198.0619 1207.3579 1224.8091 1252.9968 1283.6581 1333.1197 1371.3348 1374.4461 1386.6936 1412.4847 1429.5437 1468.6429 1570.7192 1583.3894 1612.0682 1616.6388 1662.4911 2112.3356 3072.6338 3167.4776 3187.9426 3434.9575 3516.8712 3665.0660
redmass: 11.9682 10.7845 10.9603 14.0251 6.0174 9.4750 9.5612 8.8515 11.9305 8.1444 9.1504 6.4917 8.1778 8.7319 7.2024 10.3301 5.5768 6.2655 5.4513 1.9441 2.2289 4.2168 2.5745 7.1718 4.3397 2.1521 3.4373 3.0702 5.2038 1.5665 7.2862 6.4741 8.7119 6.5348 8.3192 7.9750 7.6158 5.7310 6.2487 8.9111 1.3972 6.0028 1.5488 1.4555 2.2238 2.7719 1.4850 2.0726 7.1029 8.7168 1.6660 6.5310 2.4183 4.0543 3.1677 9.0511 10.3949 2.3904 5.1697 3.6594 7.3547 3.0424 7.8590 2.0116 3.8640 12.5232 1.0866 1.0924 1.0935 1.0681 1.0458 1.1044
irintensity: 0.0396 0.2730 0.4028 0.0817 7.7562 12.1903 3.1862 1.3813 1.4225 5.9309 10.5344 0.2118 0.2109 0.7424 5.2897 0.6628 0.9509 2.6241 7.9979 36.2473 44.7546 28.4565 7.2698 1.7225 5.4180 24.5906 55.4198 93.9905 18.8813 156.5257 28.1551 9.2810 21.4582 12.3285 17.4934 35.9548 7.7993 3.5703 1.5601 33.2723 2.8126 0.5676 20.0689 27.8997 12.5423 3.6368 23.1675 128.7821 253.0176 276.2767 163.5594 8.8691 5.4212 325.7967 22.8709 66.9787 112.7451 3.9766 29.0668 37.8359 114.5455 176.4681 71.0448 0.4355 321.7545 46.6989 7.6854 6.4238 25.3804 288.5154 91.1917 56.2280
temp: 298.150 k
press: 1.00000 atm
elementType: 8 8 8 8 8 8 7 7 7 7 6 6 6 6 6 6 6 6 6 6 1 1 1 1 1 1
symmnumber: 1
zpe: 425100.5 jmol-1
zpe.correction: 0.161912 hartree
zpe.thermalcorrener: 0.180000 hartree
zpe.thermalcorrenthalpy: 0.180944 hartree
zpe.thermalcorrgfe: 0.113415 hartree
zpe.sumelectzpe: -1053.403641 hartree
zpe.sumelectthermal: -1053.385553 hartree
zpe.sumelectthermalent: -1053.384609 hartree
zpe.sumelectthermalfe: -1053.452138 hartree
dipole: -6.5175 -0.4649 -0.0248
dipole: 6.5342
quadrupole: -105.3613 -149.7113 -114.8554
quadrupole: -1.9577 -1.2861 1.9718
quadrupole: 17.9480 -26.4020 8.4540 -1.9577 -1.2861 1.9718
hfenergy: -1053.5655533 hartree
pointgroup: C01 [X(C10H6N4O6)]
dipole: -2.5681328 0.0361116 0.1098788 debye
dipolederiv: -0.5319936 0.4760207 0.3190959 0.301311 -0.6602301 -0.2623005 0.2202749 -0.3311545 -0.5607573 -0.6508135 -0.0307797 -0.3176309 -0.1554174 -0.4716679 0.0034206 -0.2481015 0.0497556 -0.3745302 -0.3779713 -0.0603004 -0.1750154 -0.0160335 -0.7156172 0.1093848 -0.1964862 -0.0029424 -0.3125218 -0.4725108 -0.0595192 -0.0070478 0.0510986 -0.7841874 -0.2573171 0.0445816 -0.2604909 -0.3328783 -0.8960353 0.1354172 0.1178021 0.142015 -0.4587071 -0.1159762 0.1262721 -0.1244465 -0.2744647 -0.7765514 -0.1542994 -0.0028158 -0.2209174 -0.9529498 -0.0884682 -0.0175014 -0.0945719 -0.3583133 0.9301186 0.207344 0.6160704 0.3748922 1.2402824 -0.072545 0.5776573 0.0412423 0.5464354 1.3422442 -0.3498129 -0.2566895 -0.5244023 1.3974469 0.583874 -0.3341763 0.586896 0.4728315 -1.256502 0.3392566 0.0903575 0.2942714 -0.4149899 0.0307659 0.0802896 0.0296732 -0.665988 -0.2882671 0.0543893 -0.0103408 0.1015022 -0.4126939 -0.0461258 -0.0233731 -0.0433048 -0.2261521 -0.6116986 -0.0228029 -0.0138855 0.1380387 -0.3099076 -0.17904 0.2367766 -0.1689248 -0.1132872 0.496007 -0.3224383 -0.3070765 -0.1511832 0.5439942 0.3377909 -0.2012088 0.3894207 0.410735 -0.2383369 0.2952968 0.1363733 -0.0351313 -0.2604972 -0.0741358 -0.039845 -0.1073718 -0.0412948 0.5494114 -0.1937513 -0.1236004 -0.3698881 0.0475631 0.0751381 -0.1444743 0.0711394 -0.0297737 -0.6544594 0.1983471 0.1283164 0.0936698 -0.441422 -0.2661843 0.0798236 -0.2470487 -0.0719461 -0.1726667 -0.0279058 -0.0149532 0.0887526 0.3551 0.2144291 -0.0062572 0.1052832 0.0275974 1.1903327 -0.190135 -0.0710317 -0.1944311 0.0300863 -0.0006914 -0.1571313 0.0159018 -0.0015677 -0.9953557 -0.0183707 0.0311813 0.1780377 -0.3342728 -0.0539639 0.1501918 -0.0836987 -0.0038487 2.0621894 0.0519792 -0.0865383 0.3234129 1.1385698 0.1333331 -0.0078209 0.1515906 0.2834328 -0.1898678 -0.1121324 -0.0113191 -0.292197 0.5238318 0.0884282 -0.0593464 0.0968827 0.064336 0.1171589 -0.0435602 -0.0100024 -0.0619121 0.1166685 -0.0179295 -0.0349255 -0.0063182 0.157581 0.1582895 -0.0268975 -0.0041332 -0.0018902 0.1561764 -0.0142847 0.0056723 0.0157458 0.1718764 0.1826003 0.0403114 0.0121407 0.0358857 0.0720411 -0.0163047 -0.0650618 -0.0198266 0.117904 0.4862685 -0.1328317 -0.0380961 -0.0725301 0.2564228 -0.0365835 0.021376 0.0142601 0.3554365 0.3097938 -0.0378985 -0.0031349 -0.0570859 0.1658619 -0.0345191 -0.0132333 -0.0396692 0.3778185 0.2886159 -0.0149263 0.0019739 0.0301317 0.1730979 -0.0401951 0.0060273 -0.0380222 0.3813394 unknown
polarizability: 276.9272131|-23.9828823|196.6275094|-10.2936084|42.3054929|85.1318301 unknown
InChI: InChI=1S/C10H6N4O6/c11-4-6(10(12)16)1-5-2-7(13(17)18)3-8(9(5)15)14(19)20/h1-3,15H,12H2
charge 0 multiplicity 1
26 atoms
O  -0.129442 1.872097 1.083147
O  3.67206 1.900189 1.422831
O  2.160917 3.256468 0.372184
O  2.070249 -3.436035 -1.719071
O  4.004371 -2.277473 -1.347915
O  -4.145622 -1.90479 -0.214312
N  2.599822 2.106653 0.73533
N  2.721881 -2.403687 -1.301595
N  -5.304725 0.068106 0.190668
N  -3.078288 2.719611 0.44974
C  -0.250246 -0.327573 -0.118244
C  0.435669 0.839793 0.390496
C  1.859445 0.897247 0.280079
C  0.546093 -1.377557 -0.661468
C  1.941886 -1.281804 -0.727892
C  2.62406 -0.146432 -0.248257
C  -1.686345 -0.60996 -0.102883
C  -2.837589 0.127187 0.08446
C  -4.151676 -0.65966 0.006902
C  -2.921276 1.537239 0.290403
H  0.068425 -2.286911 -1.039642
H  3.715019 -0.087793 -0.286819
H  -1.934149 -1.664499 -0.309193
H  -1.115721 1.980761 1.006042
H  -5.306623 1.072893 0.365114
H  -6.194594 -0.427571 0.143195
