program: Gaussian 09
title: 000281694
version: EM64L-G09RevD.01
frameworkgroup: C1[X(C7H5Br3O)]
method: RPBEPBE
basis: SDD
operation: Freq
keyword: #p
keyword: freq=noraman
keyword: PBEPBE/SDD
title: #p freq=noraman PBEPBE/SDD
converged: NO YES NO YES
title: Mulliken charges:
elementType: Br Br Br O C C C C C C C H H H H H
charge: 0.061844 0.059133 0.067923 -0.245851 0.492205 -0.401785 -0.264012 -0.166524 -0.122933 -0.211887 -0.538160 0.275801 0.277415 0.230313 0.256204 0.230313
chargesum: 0.00000
title: Mulliken charges with hydrogens summed into heavy atoms:
elementType: Br Br Br O C C C C C C C
charge: 0.061844 0.059133 0.067923 -0.245851 0.492205 -0.401785 0.011789 -0.166524 0.154482 -0.211887 0.178670
polarizability: 1.98058150e+02 2.95701078e+00 1.41776919e+02 -1.29947546e-04 -7.44724801e-04 4.89816400e+01
1716.lowfreq: -8.4944 -7.0219 -3.8133 -0.0002 0.0003 0.0004 43.1968 88.8652 115.9714
frequency: 43.1967 88.8648 115.9713 129.5732 137.1603 152.1858 189.1233 204.3001 249.4098 250.7943 344.3465 369.6278 411.1044 442.2486 530.5005 603.8914 610.3299 671.0464 694.0445 821.7132 840.1184 878.0361 976.4822 1020.8488 1107.9116 1111.8855 1157.3775 1226.5357 1251.1336 1311.7858 1363.5037 1427.9522 1452.4127 1471.0481 1471.1457 1538.3859 1575.8584 2968.4608 3061.4464 3138.3317 3175.2518 3181.4983
redmass: 8.2823 5.1424 39.9750 25.8198 5.0331 4.5219 2.3408 57.2233 8.8842 1.4971 8.4111 5.1906 10.1459 3.0474 5.4418 10.0822 6.8680 7.2544 3.1130 8.7426 1.6394 1.3852 9.3571 5.8777 2.1560 1.2578 1.3538 3.2400 1.3339 7.4659 9.2815 1.5156 1.7897 1.0492 1.0883 8.7947 7.7448 1.0328 1.1047 1.0999 1.0926 1.0914
irintensity: 0.8645 3.8441 0.0015 0.0879 3.0114 3.3144 0.3012 0.0537 2.3917 0.0040 1.7107 1.2633 5.7506 14.0435 1.3615 0.3200 55.8624 7.4447 1.0017 22.2854 20.2673 25.3809 31.9033 132.2651 38.9560 0.0710 1.7508 97.3407 3.5806 121.1295 10.1392 143.3050 153.5563 15.9927 8.3695 2.7257 29.0486 50.9536 39.2217 15.1570 0.0531 1.0636
temp: 298.150 k
press: 1.00000 atm
elementType: 35 35 35 8 6 6 6 6 6 6 6 1 1 1 1 1
symmnumber: 1
zpe: 261783.9 jmol-1
zpe.correction: 0.099708 hartree
zpe.thermalcorrener: 0.111392 hartree
zpe.thermalcorrenthalpy: 0.112336 hartree
zpe.thermalcorrgfe: 0.058762 hartree
zpe.sumelectzpe: -384.517322 hartree
zpe.sumelectthermal: -384.505638 hartree
zpe.sumelectthermalent: -384.504694 hartree
zpe.sumelectthermalfe: -384.558268 hartree
dipole: 0.8786 2.9440 0.0004
dipole: 3.0723
quadrupole: -96.0724 -75.5045 -94.5570
quadrupole: 5.4091 0.0012 0.0010
quadrupole: -7.3611 13.2068 -5.8457 5.4091 0.0012 0.0010
hfenergy: -384.6170299 hartree
pointgroup: C01 [X(C7H5Br3O1)]
dipole: -0.7552751 0.9437203 -0.0001461 debye
dipolederiv: -0.3641254 -0.2970037 0.0001383 -0.374692 -0.3175156 0.000143 0.0001451 0.0001227 0.0083796 -0.3078248 -0.2933609 0.0001215 -0.3693243 -0.3636395 0.0001477 0.0001372 0.0001396 0.0029375 -0.5559607 0.1944382 0.0001024 0.234489 -0.0794866 -0.0000405 0.0001058 -0.0000326 0.0114477 -1.4160514 0.7099994 0.0001108 0.5702685 -0.6338112 -0.0000574 0.0002339 -0.0000987 -0.2796367 1.1891693 -0.8879934 -0.0000786 -0.3927295 0.0556327 0.000144 -0.0002553 0.000287 0.1616353 0.4275422 0.6313938 -0.000257 0.8432713 0.494623 -0.0003124 -0.0003035 -0.0002563 -0.1740878 -0.4242137 0.1346947 0.0000423 -0.2815631 -0.2034384 0.0000794 0.00014 -0.0000241 -0.1434755 0.3788031 0.6001384 -0.0002112 0.5731604 0.7270877 -0.0002689 -0.0002119 -0.0002912 -0.0771541 -0.2627321 0.0505761 0.0000532 -0.0938816 -0.1356373 0.0000482 0.0000778 0.0000113 -0.0093282 0.763838 -0.6150886 -0.0001146 -0.4351978 -0.1544095 0.0001085 -0.0001501 0.0001557 -0.1235073 0.3854003 -0.1652858 0.0000265 -0.4932533 0.6679695 0.0000353 0.0001145 -0.0000539 0.3179674 0.0699079 0.0255404 0.000023 0.0316684 -0.0234256 0.0000209 0.0000221 0.0000173 0.1687644 0.0869273 0.006594 0.000015 0.01229 0.0044248 0.0000206 0.0000161 0.0000222 0.157731 0.0749631 -0.0747335 -0.0998242 0.0887241 -0.0585694 -0.0621546 -0.0443671 -0.091421 -0.075367 -0.1206403 0.0547444 0.0000148 -0.0019906 0.0786513 0.0000089 0.0000256 0.0000006 0.1291865 0.0749972 -0.0746534 0.0998378 0.0887606 -0.058456 0.0620773 0.0442699 0.0914213 -0.0754929 unknown
polarizability: 192.1815913|17.4627997|147.6534655|-0.0363754|-0.0207109|48.981652 unknown
InChI: InChI=1S/C7H5Br3O/c1-11-7-3-5(9)4(8)2-6(7)10/h2-3H,1H3
charge 0 multiplicity 1
16 atoms
Br -2.156997 -2.482797 0.000978
Br 2.660823 2.191879 -0.00094
Br 3.470694 -1.219588 -0.000576
O  -2.446247 0.562698 0.000607
C  -1.094697 0.243783 0.000293
C  -0.752277 -1.1377 0.000425
C  -0.050671 1.201393 -0.000102
C  1.300588 0.793108 -0.000371
C  0.59264 -1.540904 0.00017
C  1.631205 -0.578204 -0.000232
C  -2.82016 1.983311 0.000169
H  -0.280221 2.269024 -0.000196
H  0.841342 -2.605053 0.000274
H  -2.444157 2.494049 0.907124
H  -3.919038 1.983551 0.000272
H  -2.444328 2.49345 -0.907194
