program: Gaussian 09
title: 000281738
version: EM64L-G09RevD.01
frameworkgroup: C1[X(C17H15N3O4)]
method: RPBEPBE
basis: SDD
operation: Freq
keyword: #p
keyword: freq=noraman
keyword: PBEPBE/SDD
title: #p freq=noraman PBEPBE/SDD
converged: YES YES NO NO
title: Mulliken charges:
elementType: O O O O N N N C C C C C C C C C C C C C C C C C H H H H H H H H H H H H H H H
charge: -0.269095 -0.258901 -0.314939 -0.329815 -0.503266 -0.359261 -0.506302 0.181802 0.504719 0.171344 -0.523879 -0.375073 -0.356311 -0.372704 -0.202944 0.256771 0.270615 0.199274 0.113670 -0.340903 -0.352193 -0.220821 -0.235066 -0.222828 0.251070 0.320488 0.253612 0.222650 0.235657 0.241458 0.324535 0.275725 0.215216 0.236254 0.233230 0.236094 0.391512 0.313465 0.295142
chargesum: 0.00000
title: Mulliken charges with hydrogens summed into heavy atoms:
elementType: O O O O N N N C C C C C C C C C C C C C C C C C
charge: -0.269095 -0.258901 -0.314939 -0.329815 -0.178731 0.032251 0.102305 0.181802 0.504719 0.171344 -0.272809 -0.054585 -0.102699 -0.150053 0.274170 0.256771 0.270615 0.199274 0.113670 -0.065178 -0.136977 0.015433 -0.001836 0.013265
polarizability: 4.03039431e+02 1.18223973e+01 2.26502038e+02 7.86837445e+00 1.31663797e+01 1.31616980e+02
1716.lowfreq: -0.4710 -0.0008 -0.0006 0.0007 3.1387 6.9123 17.3820 26.7191 37.4448
frequency: 17.3694 26.6840 37.4377 39.1466 58.1221 64.7399 82.3691 97.4094 130.6157 133.7365 170.5222 189.3429 199.5752 204.1306 219.7821 228.8299 262.5579 280.0576 317.8160 332.9376 371.5881 399.2596 402.0922 418.4068 427.0204 435.9821 491.4515 538.7401 547.6543 577.2976 593.9674 611.4349 614.7243 646.0850 678.8790 683.4088 698.2405 703.8349 721.6827 739.7216 778.2386 782.2019 793.8944 812.1737 835.2559 842.9821 847.4838 854.7825 858.4881 875.9894 911.7919 930.1715 937.0772 938.3418 976.4967 985.9551 987.6960 989.8496 1007.9053 1023.2363 1057.3236 1060.0769 1068.5809 1088.1155 1118.5239 1123.5854 1154.1255 1171.1834 1175.6174 1193.1669 1199.5355 1247.5780 1252.8624 1278.3614 1291.6564 1294.4231 1319.8271 1356.8861 1364.2482 1386.0859 1403.7785 1431.9049 1449.9490 1458.9857 1474.7875 1486.2966 1488.5560 1517.0841 1540.2603 1574.5462 1601.2992 1603.1638 1610.6702 1613.8299 1635.6042 1664.2877 3006.3083 3078.5411 3102.6104 3119.0489 3135.3717 3146.2661 3148.6779 3158.8376 3161.9116 3173.0782 3179.4199 3194.6339 3371.1479 3497.5178 3525.0629
redmass: 5.3049 5.2812 5.3412 4.8388 2.8150 5.5342 6.1815 6.0758 5.5672 6.2646 2.2015 4.0437 4.7633 2.1638 6.2655 5.6805 6.3224 7.2294 5.9013 4.6205 4.8686 4.7211 2.8701 4.8613 4.0881 4.3296 4.3419 6.6872 1.4117 6.2498 4.7047 4.4979 6.0669 7.1154 8.8611 5.4114 3.6755 1.9077 4.1792 7.7762 4.2889 5.7183 2.3729 1.8805 2.4825 3.9765 1.6478 1.3640 2.0690 2.3051 1.8317 1.6723 1.6263 1.9027 5.3346 1.4977 1.3250 4.4346 1.3447 2.6575 3.6445 3.3763 1.4792 1.6205 3.0714 1.0722 1.4384 2.6327 1.0668 1.1701 1.8584 2.4321 5.4344 2.0374 1.2959 1.5704 1.3396 3.0443 1.2682 8.9281 2.1402 2.2197 3.3524 2.0926 2.1712 1.3420 2.3916 1.9350 6.8010 3.6582 7.5467 4.9317 5.9925 6.8782 8.0691 1.1076 1.0583 1.0872 1.1134 1.0875 1.0870 1.0930 1.0920 1.0928 1.0959 1.1004 1.0949 1.0912 1.0428 1.0981 1.0762
irintensity: 0.4470 0.3397 0.0998 0.6375 11.2089 8.4681 2.6176 0.9504 2.0422 1.8791 44.0603 13.6779 4.6453 32.0553 3.9836 4.0406 2.4616 11.4277 6.1134 39.3316 4.3601 8.7189 0.3188 10.1366 7.1825 8.7525 6.7972 14.8300 35.5775 9.7252 14.9939 6.1865 1.6061 7.6939 4.3453 15.1437 25.8427 63.7395 2.0005 33.6868 26.4980 14.3096 35.0159 277.5099 34.4020 23.3680 31.5286 32.1520 58.8284 16.5718 84.6072 56.3448 21.0807 38.7240 180.0753 1.9857 4.4317 0.8866 1.2564 9.0680 14.3797 4.0202 6.9649 17.4518 12.8889 1.3754 47.4596 4.6383 1.7458 13.6946 7.6571 27.1368 315.5528 186.9891 27.8026 11.5542 6.3768 46.1640 12.0413 2.0242 114.7881 5.1109 28.9802 324.1557 132.0818 61.8241 41.0322 176.8666 140.6577 62.2497 3.6455 29.8065 3.5976 80.7865 2.2342 10.7897 153.3980 19.3295 33.3922 13.2724 0.9915 49.4501 20.3941 3.1664 16.5649 29.0794 21.6073 477.0070 7.2108 7.8878 19.0789
temp: 298.150 k
press: 1.00000 atm
elementType: 8 8 8 8 7 7 7 6 6 6 6 6 6 6 6 6 6 6 6 6 6 6 6 6 1 1 1 1 1 1 1 1 1 1 1 1 1 1 1
symmnumber: 1
zpe: 772308.3 jmol-1
zpe.correction: 0.294157 hartree
zpe.thermalcorrener: 0.315444 hartree
zpe.thermalcorrenthalpy: 0.316388 hartree
zpe.thermalcorrgfe: 0.241063 hartree
zpe.sumelectzpe: -1120.212323 hartree
zpe.sumelectthermal: -1120.191035 hartree
zpe.sumelectthermalent: -1120.190091 hartree
zpe.sumelectthermalfe: -1120.265417 hartree
dipole: 1.1132 -3.4794 -0.1472
dipole: 3.6562
quadrupole: -107.9912 -131.2068 -143.3460
quadrupole: -7.0122 -10.4927 9.0345
quadrupole: 19.5234 -3.6921 -15.8313 -7.0122 -10.4927 9.0345
hfenergy: -1120.5064793 hartree
pointgroup: C01 [X(C17H15N3O4)]
dipole: -0.5276781 1.2536545 0.4680058 debye
polarizability: 400.2756893|26.2193534|224.7258985|-3.4834348|24.0502375|136.1568608 unknown
InChI: InChI=1S/C17H15N3O4/c18-20-17(22)13(19-16(21)12-4-2-1-3-5-12)8-11-6-7-14-15(9-11)24-10-23-14/h1-9,19-20H,10,18H2
charge 0 multiplicity 1
39 atoms
O  5.087956 2.267739 1.638054
O  6.38695 0.783195 0.268021
O  -2.470685 -1.54335 1.139594
O  0.704916 -1.900471 -2.09636
N  -1.621969 0.082668 -0.304579
N  -0.669738 -2.791408 -0.45425
N  -0.680204 -4.066598 -1.090393
C  4.238396 1.418361 0.880734
C  2.194397 0.469979 -0.014906
C  5.005319 0.547558 0.076247
C  2.84868 1.414565 0.851052
C  2.984562 -0.392203 -0.833923
C  4.401322 -0.361046 -0.797294
C  0.723626 0.501605 0.003108
C  6.466479 1.780657 1.371696
C  -0.244927 -0.387807 -0.39767
C  -3.942292 0.272089 0.487625
C  -2.630263 -0.461646 0.47525
C  -0.017534 -1.738084 -1.045787
C  -5.095367 -0.460074 0.870951
C  -4.068771 1.650107 0.16603
C  -6.358087 0.165616 0.906163
C  -5.333355 2.276032 0.205622
C  -6.481573 1.534355 0.56874
H  2.270653 2.099116 1.479374
H  2.479703 -1.067639 -1.530349
H  4.998201 -1.014687 -1.43821
H  0.315082 1.407618 0.478018
H  6.856493 1.280773 2.277473
H  7.089894 2.627115 1.043118
H  -1.860911 0.887654 -0.888442
H  -4.973463 -1.514123 1.139724
H  -3.187867 2.2574 -0.077197
H  -7.24367 -0.409704 1.196343
H  -5.422025 3.340705 -0.035663
H  -7.462137 2.021976 0.597536
H  -1.359657 -2.610112 0.305546
H  -0.298389 -3.946824 -2.042784
H  -0.120746 -4.743004 -0.55071
