program: Gaussian 09
title: 000281723
version: EM64L-G09RevD.01
frameworkgroup: C1[X(C18H21NO3)]
method: RPBEPBE
basis: SDD
operation: Freq
keyword: #p
keyword: freq=noraman
keyword: PBEPBE/SDD
title: #p freq=noraman PBEPBE/SDD
converged: YES YES NO NO
title: Mulliken charges:
elementType: O O O N C C C C C C C C C C C C C C C C C C H H H H H H H H H H H H H H H H H H H H H
charge: -0.286498 -0.255694 -0.431473 -0.037929 0.239402 -0.171788 -0.209234 -0.241710 -0.497564 0.041377 -0.584278 -0.481488 -0.128010 0.361001 -0.244352 0.017505 -0.220114 -0.647504 -0.416709 0.114630 -0.348953 -0.523978 0.237280 0.216617 0.267194 0.215709 0.228521 0.224951 0.246690 0.256985 0.212967 0.255061 0.220092 0.221947 0.185639 0.230023 0.229175 0.235407 0.245729 0.193701 0.222608 0.234407 0.372662
chargesum: 0.00000
title: Mulliken charges with hydrogens summed into heavy atoms:
elementType: O O O N C C C C C C C C C C C C C C C C C C
charge: -0.286498 -0.255694 -0.058811 -0.037929 0.239402 0.065491 0.007382 0.025484 -0.053334 0.041377 -0.112637 -0.011535 0.127050 0.361001 -0.024260 0.017505 0.001833 -0.002667 -0.181302 0.114630 -0.103225 0.126738
polarizability: 2.24971814e+02 -3.44942101e+00 2.05084763e+02 -4.28893782e+00 -1.69439477e+01 1.56654117e+02
1716.lowfreq: -1.9689 -0.0007 -0.0005 0.0003 9.5675 18.6861 43.5342 67.5958 88.9879
frequency: 43.4713 67.5617 88.9861 117.6543 122.7775 146.2382 182.8144 189.1353 198.1781 220.3921 228.0322 246.0462 271.8197 287.4021 296.7939 320.3954 334.6945 343.0198 378.3548 387.4621 412.5045 429.4166 442.5460 455.9788 470.7179 487.2688 507.6418 541.3977 554.1567 560.1594 584.6398 601.6275 649.5569 671.8205 686.0373 700.8330 723.6787 741.1372 776.3818 794.4511 802.9734 827.3693 849.5701 872.8146 891.9236 908.2855 924.6159 926.9798 942.3295 949.2730 968.0212 974.5813 1007.3975 1011.6952 1029.9727 1043.9948 1056.1084 1060.6837 1092.7050 1109.8236 1112.8837 1114.9938 1122.7807 1126.9909 1144.3401 1156.7806 1157.6502 1162.5032 1173.7020 1194.1619 1205.5716 1223.8723 1231.2190 1243.5889 1264.5891 1281.9330 1291.6404 1300.7963 1312.3840 1316.0698 1320.7241 1326.6406 1335.6385 1338.4311 1352.1521 1361.7626 1378.6686 1413.3679 1429.3895 1429.9060 1435.4134 1451.3465 1453.2446 1456.5647 1462.7702 1466.5288 1480.1479 1487.4102 1504.4394 1618.9012 1652.2307 1653.4804 2853.9637 2931.1155 2935.6418 2963.3401 2971.3026 2997.8651 3000.6677 3010.9063 3018.7922 3031.0827 3034.3952 3050.4476 3059.4426 3066.9616 3071.3254 3085.8001 3103.1144 3129.5077 3133.7215 3165.4682 3565.4699
redmass: 4.2504 5.3501 3.9691 2.9719 3.1010 3.3088 2.1756 1.7972 1.1263 2.9151 2.7712 3.2135 2.9658 4.0076 4.5533 3.5967 3.7267 3.6897 1.1548 3.5274 4.0148 3.3835 3.1081 3.5489 4.6718 3.3671 4.3822 4.1829 3.8251 3.8937 5.0357 5.0918 4.7258 5.6768 2.1208 4.2795 4.6610 3.6455 3.7722 2.0018 1.8582 5.8284 2.7745 2.9888 3.8876 4.2549 1.6707 1.9578 3.7723 2.3784 1.7861 1.8688 5.4662 2.7325 2.1007 2.4315 2.2703 2.8769 4.2605 1.5185 1.7914 1.2702 1.9229 1.9376 1.4709 1.4084 1.4709 1.6963 1.2183 1.7739 2.1501 1.6198 1.4458 1.4862 1.6593 1.6688 1.3661 1.5358 1.5885 1.2762 1.3396 1.7181 1.9651 1.5765 1.2424 1.4578 1.5982 5.8864 1.1356 1.1750 2.1410 1.2759 1.2292 1.0574 1.0736 1.0851 1.0521 1.0481 3.6322 8.8873 8.8859 7.3277 1.0571 1.0451 1.0727 1.0621 1.0651 1.0757 1.0696 1.0712 1.0967 1.0974 1.0978 1.0853 1.1042 1.0871 1.1007 1.0866 1.0982 1.0889 1.0969 1.0946 1.0660
irintensity: 0.4467 0.2599 0.4202 0.4395 2.2101 0.4197 1.4498 0.1386 0.0364 4.9962 6.1569 2.5324 0.6902 3.0539 0.6772 6.0044 3.7471 4.5026 133.8203 6.4090 3.0258 3.2696 0.6175 4.5008 1.5162 0.9687 4.3169 4.6789 49.2022 2.9912 4.3507 4.1219 1.7139 3.0939 14.7584 0.9362 6.4909 6.4648 31.0837 30.1442 18.3951 62.3125 8.3149 6.5144 16.0048 25.2331 0.7629 4.7190 10.9310 9.3577 2.9662 3.4332 51.4408 74.2131 21.2236 15.8859 30.0903 4.4503 3.1660 9.1199 27.9955 0.7362 17.3237 40.3502 61.1009 1.4807 1.0295 110.0591 5.5023 49.0390 20.7222 3.3931 3.9862 2.7503 1.2482 10.7497 8.4619 6.0644 5.2751 1.3688 5.3905 6.0210 17.1447 0.9917 2.0304 13.8714 3.1517 17.1281 1.6931 7.9314 24.0606 32.5765 24.3938 12.7289 31.1113 15.5731 19.8976 5.0476 48.7173 30.0813 18.1257 6.6879 99.8933 25.9348 51.0500 39.8689 14.3341 65.1857 18.9622 68.8164 56.9540 12.2702 32.9166 8.2549 35.1882 21.4430 35.0531 12.2557 33.3051 11.3818 30.1500 11.3267 54.6544
temp: 298.150 k
press: 1.00000 atm
elementType: 8 8 8 7 6 6 6 6 6 6 6 6 6 6 6 6 6 6 6 6 6 6 1 1 1 1 1 1 1 1 1 1 1 1 1 1 1 1 1 1 1 1 1
symmnumber: 1
zpe: 930947.3 jmol-1
zpe.correction: 0.354579 hartree
zpe.thermalcorrener: 0.373175 hartree
zpe.thermalcorrenthalpy: 0.374119 hartree
zpe.thermalcorrgfe: 0.309921 hartree
zpe.sumelectzpe: -977.250102 hartree
zpe.sumelectthermal: -977.231506 hartree
zpe.sumelectthermalent: -977.230562 hartree
zpe.sumelectthermalfe: -977.294760 hartree
dipole: 4.2123 -0.9967 0.4809
dipole: 4.3552
quadrupole: -130.6303 -137.7057 -124.1590
quadrupole: 0.2928 -1.7705 -1.9817
quadrupole: 0.2014 -6.8740 6.6727 0.2928 -1.7705 -1.9817
hfenergy: -977.6046809 hartree
pointgroup: C01 [X(C18H21N1O3)]
dipole: -1.7072748 -0.039519 -0.1403141 debye
polarizability: 225.4176434|-0.2164276|203.2759287|-2.766809|19.0832255|158.0171214 unknown
InChI: InChI=1S/C18H21NO3/c1-19-8-7-18-11-4-6-14(21-2)17(18)22-16-13(20)5-3-10(15(16)18)9-12(11)19/h3-6,11-12,14,17,20H,7-9H2,1-2H3
charge 0 multiplicity 1
43 atoms
O  1.719027 1.172846 1.138874
O  -0.457836 3.847719 0.117426
O  4.374728 -0.137207 0.559936
N  -2.51878 -1.923949 0.404591
C  -0.463661 0.206287 0.576025
C  -1.559425 0.216745 -0.526131
C  -1.926887 -1.292656 -0.812857
C  0.261817 1.560662 0.859138
C  -1.068525 -0.418485 1.872007
C  0.694504 -0.633265 0.061559
C  -0.727541 -2.135903 -1.353153
C  -1.613347 -1.846062 1.583911
C  0.251341 2.598415 -0.301362
C  0.627446 -1.758139 -0.767346
C  -1.124914 1.021767 -1.730896
C  1.900927 -0.065999 0.471842
C  -0.286408 2.08657 -1.624589
C  -3.909722 -1.513743 0.680761
C  1.866308 -2.378226 -1.090199
C  3.133891 -0.6682 0.16699
C  3.09228 -1.854671 -0.610044
C  -1.907849 3.713972 0.284481
H  -2.482718 0.680658 -0.113295
H  -2.716818 -1.312134 -1.590005
H  -0.072751 2.052024 1.788066
H  -1.881262 0.240074 2.242847
H  -0.295544 -0.468681 2.663061
H  -0.674823 -2.005569 -2.453154
H  -0.973557 -3.199973 -1.175461
H  -0.757978 -2.524312 1.409666
H  -2.158367 -2.232759 2.464124
H  1.285145 2.965357 -0.420344
H  -1.524235 0.733082 -2.714356
H  -0.008573 2.668909 -2.511918
H  -4.049991 -0.440146 0.963328
H  -4.308838 -2.127415 1.508445
H  -4.531911 -1.707562 -0.212113
H  1.885219 -3.265176 -1.734147
H  4.043259 -2.333451 -0.864223
H  -2.170707 2.992205 1.087871
H  -2.40539 3.403566 -0.655169
H  -2.260436 4.716257 0.574507
H  4.233901 0.705365 1.061806
