program: Gaussian 09
title: 000281660
version: EM64L-G09RevD.01
frameworkgroup: C1[X(C8H13N3O3)]
method: RPBEPBE
basis: SDD
operation: Freq
keyword: #p
keyword: freq=noraman
keyword: PBEPBE/SDD
title: #p freq=noraman PBEPBE/SDD
converged: YES YES NO NO
title: Mulliken charges:
elementType: O O O N N N C C C C C C C C H H H H H H H H H H H H H
charge: -0.284476 -0.415484 -0.234684 -0.283473 -0.334129 -0.411100 -0.222674 -0.346921 -0.329872 0.389757 -0.484513 0.122640 -0.793026 0.187824 0.232773 0.251793 0.218565 0.246849 0.224975 0.333396 0.235631 0.272630 0.328922 0.242574 0.239982 0.236066 0.375974
chargesum: 0.00000
title: Mulliken charges with hydrogens summed into heavy atoms:
elementType: O O O N N N C C C C C C C C
charge: -0.284476 -0.039510 -0.234684 -0.031680 -0.000733 -0.082178 0.010099 0.118493 -0.104897 0.389757 0.023749 0.122640 -0.074404 0.187824
polarizability: 1.21204655e+02 7.85181040e+00 1.08817026e+02 -1.40794731e+01 -1.28876566e+00 1.15999596e+02
1716.lowfreq: -4.3261 -0.0006 -0.0006 0.0005 2.0214 9.0784 23.4348 32.8339 40.0669
frequency: 23.3617 32.8133 40.0612 74.8303 85.6717 121.2367 146.4491 152.9058 176.0129 241.2951 279.2919 297.6368 368.1226 434.8396 475.1698 494.6269 505.2972 512.7566 530.2771 548.3830 561.2297 591.2945 623.1128 636.4642 640.2788 717.7248 749.1374 790.0983 818.9917 861.0530 898.0280 923.8127 958.9001 1000.9555 1028.7737 1045.2297 1051.3215 1071.7598 1100.0207 1108.0980 1137.2074 1171.8760 1195.9543 1240.3528 1261.9816 1276.6523 1316.5030 1323.6652 1355.3739 1383.5180 1395.4452 1401.5914 1417.0867 1436.2045 1437.6143 1450.8731 1464.9648 1475.7141 1487.4654 1662.2413 1667.7584 1694.9149 2943.8244 2967.5625 2976.2805 2996.9813 3043.0868 3051.5613 3063.8525 3109.7402 3171.1857 3446.9792 3512.2113 3555.2312 3575.5067
redmass: 10.9301 7.2009 4.6620 1.8907 4.3689 3.1447 1.8220 2.2315 2.8121 4.3520 4.4065 3.5121 3.7524 4.2430 4.6162 2.2116 2.6480 2.8166 3.3115 1.4978 2.1206 2.7593 2.8510 1.5796 1.3410 4.5629 1.6359 1.3674 2.8497 4.5377 4.4408 2.3665 3.0739 2.4237 3.1515 1.7788 1.5075 1.9115 2.4299 3.8991 2.3713 1.3135 1.5907 1.4790 2.2242 1.1555 1.5787 1.4605 1.3009 1.7012 2.0174 1.2500 2.2241 1.7619 1.1067 1.3750 1.0436 1.1446 1.0838 4.8575 8.0608 6.7236 1.0694 1.0858 1.0385 1.0622 1.0918 1.0981 1.0971 1.0970 1.0927 1.0752 1.0639 1.0764 1.0780
irintensity: 1.0333 0.4319 2.4727 0.4062 0.5916 1.9410 1.4310 0.4225 2.0994 2.9588 5.0952 13.7779 5.0141 30.2217 16.6529 62.1520 19.3986 27.1890 37.2283 17.4081 62.5515 45.4480 39.9362 113.9529 117.7486 102.8298 3.0233 13.0140 18.9256 3.0191 4.0382 2.7566 10.8591 13.4691 359.9194 6.5754 4.2718 9.1419 45.7507 57.1889 18.7350 13.7316 26.9506 10.1194 55.3883 9.9596 51.2201 14.6596 17.9561 54.0306 65.8360 32.9665 70.1723 45.6890 23.9970 32.6118 16.1602 10.0673 10.3978 497.2527 230.1550 99.1277 43.5913 57.9571 30.4171 12.6157 1.5585 17.2876 20.8718 15.6363 5.0948 0.6175 19.3331 31.2074 50.8661
temp: 298.150 k
press: 1.00000 atm
elementType: 8 8 8 7 7 7 6 6 6 6 6 6 6 6 1 1 1 1 1 1 1 1 1 1 1 1 1
symmnumber: 1
zpe: 566947.9 jmol-1
zpe.correction: 0.215939 hartree
zpe.thermalcorrener: 0.230551 hartree
zpe.thermalcorrenthalpy: 0.231496 hartree
zpe.thermalcorrgfe: 0.172029 hartree
zpe.sumelectzpe: -701.516614 hartree
zpe.sumelectthermal: -701.502001 hartree
zpe.sumelectthermalent: -701.501057 hartree
zpe.sumelectthermalfe: -701.560524 hartree
dipole: -0.8572 3.1998 3.6711
dipole: 4.9447
quadrupole: -76.9302 -86.1260 -82.2109
quadrupole: 11.0628 2.9425 -5.8163
quadrupole: 4.8255 -4.3702 -0.4552 11.0628 2.9425 -5.8163
hfenergy: -701.7325526 hartree
pointgroup: C01 [X(C8H13N3O3)]
dipole: 0.6577018 0.9387385 -1.5718591 debye
polarizability: 120.9180925|-11.755611|112.4700556|-11.4392783|2.8003072|112.6331292 unknown
InChI: InChI=1S/C8H13N3O3/c1-5-4-6(11-8(14)10-5)9-3-2-7(12)13/h4,6,9-12H,2-3H2,1H3
charge 0 multiplicity 1
27 atoms
O  -2.586073 -1.352621 2.023541
O  4.81437 -0.679347 1.127233
O  3.201194 0.865865 1.760458
N  0.532787 -0.928163 -1.176926
N  -1.60098 -1.328568 -0.10099
N  -2.33882 0.675329 0.886878
C  -0.935542 -0.672432 -1.246481
C  1.306577 -0.16314 -0.17458
C  -1.33915 0.792747 -1.293226
C  -1.966493 1.417391 -0.254004
C  2.687461 -0.816109 0.011587
C  -2.190595 -0.719196 0.99901
C  -2.324884 2.88491 -0.217672
C  3.535814 -0.102869 1.044104
H  -1.259808 -1.179618 -2.178406
H  0.966465 -0.930037 -2.109801
H  1.427229 0.912588 -0.428613
H  0.756818 -0.197278 0.782484
H  -1.066178 1.360229 -2.186168
H  -1.43714 -2.331433 0.007498
H  3.255336 -0.842872 -0.939329
H  2.56733 -1.871878 0.319639
H  -2.797119 1.126141 1.678937
H  -2.010943 3.384202 -1.14742
H  -1.827256 3.39604 0.628946
H  -3.416334 3.027628 -0.101364
H  5.342035 -0.20281 1.824664
