program: Gaussian 09
title: 000281685
version: EM64L-G09RevD.01
frameworkgroup: C1[X(C20H20O2)]
method: RPBEPBE
basis: SDD
operation: Freq
keyword: #pfreq=noraman
keyword: PBEPBE/SDD
title: #p freq=noraman PBEPBE/SDD
converged: YES YES NO NO
title: Mulliken charges:
elementType: O O C C C C C C C C C C C C C C C C C C C C H H H H H H H H H H H H H H H H H H H H
charge: -0.294606 -0.268039 0.077566 0.200576 0.509784 0.169770 0.251832 0.155177 0.365975 0.040117 -0.738655 -0.659709 -0.386341 -0.624956 -0.876923 0.470324 -0.862474 -0.413901 -0.850199 0.155169 -0.819015 -0.500124 0.248327 0.286392 0.258369 0.307762 0.243412 0.226013 0.269849 0.248368 0.241708 0.239312 0.230555 0.237071 0.232012 0.232107 0.224486 0.235845 0.227632 0.228963 0.240209 0.240260
chargesum: 0.00000
title: Mulliken charges with hydrogens summed into heavy atoms:
elementType: O O C C C C C C C C C C C C C C C C C C C C
charge: -0.294606 -0.268039 0.077566 0.200576 0.509784 0.169770 0.251832 0.155177 0.365975 0.040117 -0.490328 -0.373316 -0.127972 -0.317194 -0.137649 0.470324 -0.133085 -0.183346 -0.149010 0.155169 -0.131053 0.209308
polarizability: 3.69056521e+02 -2.30864292e+01 2.82763376e+02 -1.52109081e+00 2.27999021e+00 1.12571929e+02
1716.lowfreq: -3.9102 -0.0007 -0.0003 0.0005 3.0439 6.1057 30.3913 41.6227 58.2909
frequency: 30.3820 41.5943 58.2860 63.9761 88.9403 100.6873 112.8837 123.2790 136.0606 148.5805 168.9702 182.5110 202.3593 225.5015 247.0465 262.4515 277.9429 288.3304 300.8560 330.1663 333.6235 353.4406 368.8329 387.0624 401.6404 435.1756 447.8939 491.9039 500.9593 525.4652 545.1277 558.0699 595.1857 602.9349 610.5765 644.6506 671.8339 704.8153 721.7976 738.0571 760.4726 788.8703 803.6091 835.4375 854.3916 877.5023 912.4483 932.9968 938.7501 963.2842 969.1531 981.2265 999.0035 1007.6922 1011.3015 1017.5991 1038.5129 1051.8597 1052.5589 1057.1441 1081.1834 1104.9013 1113.6997 1141.8865 1148.2103 1168.6109 1212.3799 1233.6636 1252.6400 1267.3172 1297.4265 1311.6371 1359.9726 1377.2833 1381.2723 1389.9690 1397.0470 1399.2475 1402.0852 1406.2564 1422.9483 1423.8711 1447.2020 1450.8254 1451.2919 1462.2228 1465.1848 1470.6063 1474.7323 1477.9799 1480.0377 1487.6384 1497.0134 1506.3568 1526.3487 1564.4925 1591.3796 1613.1193 1616.9631 1627.6724 2966.9643 2968.6045 2971.9450 2973.4552 3000.8528 3046.5979 3048.9532 3051.9895 3057.7856 3082.4703 3088.5432 3098.3717 3100.8527 3102.4506 3119.8961 3120.3148 3142.3312 3164.1543 3171.2645 3198.9152
redmass: 5.7382 3.7221 2.7108 1.1583 3.0849 1.8825 1.2853 3.0276 1.9038 2.0798 3.8729 2.8515 1.1545 3.3929 3.2838 3.3905 2.0560 3.2103 2.4374 3.9193 3.3150 3.2843 6.5335 3.9508 2.6406 3.2148 3.3379 4.7837 3.5839 5.2207 4.0402 3.0503 4.7300 5.0435 4.7991 3.3789 5.5838 5.3602 5.3830 5.2497 4.1446 3.7447 2.4264 1.7731 6.4051 1.3878 2.9975 1.7387 2.3577 1.6205 1.3963 2.4105 1.8416 1.4818 1.4085 2.7716 1.5335 1.5591 1.7367 2.4566 2.0185 3.4964 1.2616 1.9293 2.3720 1.6078 1.9131 1.6968 2.0614 2.1703 4.2056 2.2024 3.4160 4.7024 4.4143 1.3485 1.2465 1.2849 2.1116 1.5121 2.6619 1.2475 1.6870 1.0518 2.3363 1.1291 1.0539 1.0466 1.3866 1.1127 1.0965 1.5866 1.1981 1.0633 3.4515 6.7950 7.5752 7.0845 6.9873 6.4596 1.0446 1.0456 1.0381 1.0377 1.0295 1.0970 1.0972 1.0892 1.0891 1.0982 1.0983 1.0978 1.1042 1.0973 1.0917 1.0905 1.1045 1.0914 1.0919 1.0915
irintensity: 1.6020 0.2397 1.4989 0.0172 0.3884 1.2855 0.2322 0.8613 0.8464 1.3384 0.8254 0.7192 3.1372 4.5012 5.0113 3.9665 3.6585 1.8568 1.3283 8.9646 0.7669 0.3498 7.1761 2.3096 0.6896 0.5825 0.2971 2.0982 8.6168 0.0280 3.8626 0.3891 1.4184 1.0356 3.4186 2.3685 4.2923 0.6485 12.0980 1.4547 1.2779 1.3327 20.8590 20.4088 29.1074 3.5242 2.1158 5.7754 3.3700 19.4826 5.0327 10.4812 47.9929 10.3748 13.8769 41.9182 6.7244 13.1208 11.6201 15.3594 6.0435 218.1180 0.2933 113.6576 3.9910 67.3468 147.4419 2.9600 42.2587 42.1629 7.4548 3.6183 11.1311 1.7994 11.4877 0.5617 11.5344 20.5845 19.5641 2.6541 5.5525 35.5343 5.1271 12.4793 30.1540 27.7101 13.3454 12.7281 53.4363 17.0781 29.2129 5.8740 10.0486 2.8823 17.3050 20.4681 47.7814 109.5461 122.1945 50.9015 52.2240 16.2357 52.4469 42.3603 54.2647 23.4899 21.7745 30.1269 10.5162 21.4321 16.0188 25.6202 28.3519 3.6923 23.4289 12.9759 16.7844 0.3167 10.6601 11.1781
temp: 298.150 k
press: 1.00000 atm
elementType: 8 8 6 6 6 6 6 6 6 6 6 6 6 6 6 6 6 6 6 6 6 6 1 1 1 1 1 1 1 1 1 1 1 1 1 1 1 1 1 1 1 1
symmnumber: 1
zpe: 896391.5 jmol-1
zpe.correction: 0.341417 hartree
zpe.thermalcorrener: 0.362421 hartree
zpe.thermalcorrenthalpy: 0.363365 hartree
zpe.thermalcorrgfe: 0.291756 hartree
zpe.sumelectzpe: -923.048241 hartree
zpe.sumelectthermal: -923.027237 hartree
zpe.sumelectthermalent: -923.026293 hartree
zpe.sumelectthermalfe: -923.097902 hartree
dipole: 3.0669 -0.2650 -0.2498
dipole: 3.0884
quadrupole: -115.8798 -108.2954 -133.8521
quadrupole: 3.5594 2.4672 -0.1164
quadrupole: 3.4627 11.0470 -14.5097 3.5594 2.4672 -0.1164
hfenergy: -923.3896581 hartree
pointgroup: C01 [X(C20H20O2)]
dipole: 1.2072486 0.0862364 0.1074693 debye
polarizability: 369.5490555|21.9604472|281.7678098|3.6387302|9.3466433|113.0749609 unknown
InChI: InChI=1S/C20H20O2/c1-11-6-7-16-17(8-11)18(20(21)22-5)10-15-9-12(2)13(3)14(4)19(15)16/h6-10H,1-5H3
charge 0 multiplicity 1
42 atoms
O  -2.544211 3.070768 0.237408
O  -3.891816 1.264989 -0.30129
C  1.102378 -0.439051 0.0814
C  -0.150634 -1.21149 0.117509
C  0.996761 0.985169 0.283069
C  2.422519 -0.979579 -0.1529
C  -1.436426 -0.54073 0.054414
C  3.573651 -0.166015 0.048687
C  3.4488 1.228622 0.378536
C  -1.47414 0.924014 0.093465
C  2.166487 1.783536 0.436477
C  -0.286583 1.625017 0.274696
C  -0.170355 -2.630741 0.307205
C  -2.633919 -1.324854 0.039219
C  2.647481 -2.373527 -0.730437
C  -2.618657 -2.724036 0.152319
C  4.962716 -0.764292 -0.125848
C  -1.359258 -3.366997 0.326276
C  4.664535 2.111864 0.603157
C  -2.744971 1.698986 -0.014729
C  -3.903363 -3.531662 0.129278
C  -3.754883 3.911587 0.12546
H  2.044485 2.860833 0.602998
H  -0.324988 2.713299 0.37487
H  0.763393 -3.158181 0.501419
H  -3.588309 -0.801348 -0.049765
H  3.506048 -2.360774 -1.423524
H  2.874574 -3.136021 0.041625
H  1.771022 -2.720924 -1.299007
H  5.730291 -0.161555 0.38444
H  5.021357 -1.789999 0.27719
H  5.251351 -0.819708 -1.195421
H  -1.322045 -4.450981 0.491034
H  4.358037 3.156006 0.783836
H  5.25493 1.782553 1.479918
H  5.34837 2.108134 -0.266525
H  -4.008949 -4.147136 1.042892
H  -4.788422 -2.877772 0.055418
H  -3.923193 -4.226106 -0.732491
H  -3.40919 4.930555 0.351264
H  -4.520661 3.582561 0.848294
H  -4.175112 3.850287 -0.892835
