program: Gaussian 09
title: 000281648
version: EM64L-G09RevD.01
frameworkgroup: C1[X(C8H7N3)]
method: RPBEPBE
basis: SDD
operation: Freq
keyword: #p
keyword: freq=noraman
keyword: PBEPBE/SDD
title: #p freq=noraman PBEPBE/SDD
converged: YES YES NO NO
title: Mulliken charges:
elementType: N N N C C C C C C C C H H H H H H H
charge: -0.483420 -0.002917 -0.002921 0.401658 0.401661 -0.409092 -0.409096 -0.563313 -0.563307 -0.150945 -0.150953 0.346955 0.252547 0.252548 0.267604 0.272700 0.272707 0.267583
chargesum: 0.00000
title: Mulliken charges with hydrogens summed into heavy atoms:
elementType: N N N C C C C C C C C
charge: -0.136465 -0.002917 -0.002921 0.401658 0.401661 -0.156545 -0.156548 -0.023009 -0.023017 -0.150945 -0.150953
polarizability: 1.07121170e+02 -8.38729990e-03 1.16699327e+02 2.33354165e-03 1.86758067e+00 5.52093050e+01
1716.lowfreq: -10.1710 -2.3297 -0.0007 -0.0005 -0.0001 4.4463 4.7554 30.9056 77.3436
frequency: -8.4749 30.9048 77.3436 112.7518 186.1089 257.5909 283.8148 353.0327 353.4840 371.4924 442.1321 486.1144 608.7210 615.8618 627.6044 695.9033 750.9344 780.3733 848.7933 915.2521 921.2862 922.7308 931.3750 978.5670 993.6743 1050.2301 1170.7286 1191.0527 1209.0656 1265.8757 1273.1590 1306.9402 1310.5585 1410.5065 1429.9486 1443.0230 1446.8777 1516.5888 1591.0764 2199.6411 2199.9364 2966.6883 2966.8888 3051.0576 3051.1186 3207.8771 3227.1498 3559.6668
redmass: 4.1638 5.3220 6.8975 9.1353 2.8844 6.3164 3.9013 3.5335 3.5297 3.9168 9.1369 7.5101 4.3130 3.2845 1.2289 4.2359 4.5617 1.2149 1.3805 3.5194 2.4095 2.4260 3.0977 3.5067 3.7103 1.3521 1.2569 1.1636 1.2082 1.5919 1.7072 1.3838 3.3933 3.2046 2.1372 1.1132 1.3778 8.3362 4.2132 12.4536 12.4489 1.0668 1.0668 1.0914 1.0913 1.0934 1.1044 1.0811
irintensity: 2.8652 7.5365 2.2078 10.9481 12.3323 0.8613 0.4892 0.8351 1.0727 1.0783 0.3190 0.1717 4.7252 0.0010 55.2661 14.3349 1.3772 111.4703 0.8525 7.3208 3.9561 4.7345 0.6901 2.0676 0.1040 26.5380 22.0871 0.3363 1.4918 35.3013 0.5690 0.1858 12.2710 7.2013 40.5826 10.0217 3.2659 13.0480 14.7087 1.9608 10.9680 27.6929 8.6834 0.7888 1.8724 5.4400 1.3211 56.9519
temp: 298.150 k
press: 1.00000 atm
elementType: 7 7 7 6 6 6 6 6 6 6 6 1 1 1 1 1 1 1
symmnumber: 1
zpe: 350455.0 jmol-1
zpe.correction: 0.133481 hartree
zpe.thermalcorrener: 0.142987 hartree
zpe.thermalcorrenthalpy: 0.143931 hartree
zpe.thermalcorrgfe: 0.097326 hartree
zpe.sumelectzpe: -472.493669 hartree
zpe.sumelectthermal: -472.484163 hartree
zpe.sumelectthermalent: -472.483219 hartree
zpe.sumelectthermalfe: -472.529824 hartree
dipole: 0.0009 -5.6396 2.2203
dipole: 6.0609
quadrupole: -60.9608 -77.8929 -64.0661
quadrupole: 0.0042 0.0038 5.1047
quadrupole: 6.6791 -10.2529 3.5739 0.0042 0.0038 5.1047
hfenergy: -472.6271501 hartree
pointgroup: C01 [X(C8H7N3)]
dipole: -0.0001611 2.3489382 0.4104596 debye
dipolederiv: -0.1667287 0.0000927 -0.0000575 0.000073 -0.521812 0.2007554 -0.0000804 0.288353 -0.3880113 -0.2139004 -0.0023106 0.0038057 0.1034987 -0.2560581 0.0128375 0.0033616 0.0154299 -0.2206969 -0.2139351 0.0022947 -0.0037845 -0.1037889 -0.2560948 0.0131169 -0.0034382 0.015452 -0.2206499 0.0789825 -0.0026926 -0.0616041 0.0367734 0.1552458 -0.181439 0.0842172 -0.2220528 0.0771851 0.0789341 0.0025702 0.0616492 -0.0369559 0.1551625 -0.1814168 -0.0841269 -0.2220535 0.0771674 -0.0723858 0.0258312 -0.0066014 0.0273381 -0.1377922 -0.0653462 0.0209579 -0.0874727 -0.2006051 -0.0723297 -0.0258789 0.0065081 -0.0273129 -0.1377746 -0.0653296 -0.0210878 -0.0875105 -0.2005882 0.2755832 -0.0550512 0.052911 -0.0823819 0.0683388 0.0053637 -0.0672353 0.0622879 0.2485048 0.2755652 0.0550051 -0.0529323 0.0824645 0.0683969 0.0052707 0.0672783 0.0623514 0.2485223 -0.1564422 0.0149434 -0.0197579 -0.070063 0.1768417 0.0046314 0.0145988 -0.0342663 -0.0481502 -0.1563518 -0.0148454 0.0197822 0.0702498 0.176829 0.004454 -0.0145251 -0.034343 -0.0482197 0.267225 -0.0000034 0.0000256 0.0000209 0.2096429 0.0430158 0.0000109 0.0286967 0.3030874 0.0167443 -0.0898724 0.0487348 -0.0695297 0.0801144 0.0725345 0.0459237 0.0799217 0.1551958 0.0166892 0.0899102 -0.0486666 0.0695663 0.0801208 0.0724978 -0.0458524 0.0798704 0.155241 -0.0175969 0.0466455 -0.0605753 0.0653775 0.0358683 -0.0086173 -0.1377668 -0.0152702 -0.0378405 0.038751 0.0022829 0.0418434 -0.0099138 0.0335332 0.0381336 0.0926593 0.0429254 0.0688726 0.0386811 -0.0022554 -0.0418318 0.0099722 0.0335256 0.0381082 -0.0926448 0.0429422 0.0689726 -0.0174851 -0.046666 0.0605512 -0.0653881 0.0359119 -0.0085707 0.13775 -0.0152616 -0.0379871 unknown
polarizability: 107.1211676|-0.0105583|113.4883346|-0.0091194|-13.8065709|58.4203002 unknown
InChI: InChI=1S/C8H7N3/c9-5-3-7-1-2-8(11-7)4-6-10/h1-2,11H,3-4H2
charge 0 multiplicity 1
18 atoms
N  0.000073 0.097687 0.508261
N  2.822719 -2.338681 0.332124
N  -2.821834 -2.338852 0.33235
C  1.143352 0.785127 0.08933
C  -1.143453 0.785075 0.089919
C  0.719661 1.933725 -0.589444
C  -0.720163 1.933694 -0.58907
C  2.542925 0.315599 0.420366
C  -2.542831 0.315477 0.421675
C  2.70487 -1.151819 0.359957
C  -2.70483 -1.151928 0.361052
H  0.000212 -0.82436 0.948776
H  1.370103 2.682981 -1.038295
H  -1.370871 2.68292 -1.037583
H  2.852519 0.645885 1.433789
H  3.252316 0.779097 -0.288738
H  -3.25263 0.779128 -0.286919
H  -2.851837 0.645545 1.435348
