program: Gaussian 09
title: 000281666
version: EM64L-G09RevD.01
frameworkgroup: C1[X(C15H18N2O2)]
method: RPBEPBE
basis: SDD
operation: Freq
keyword: #p
keyword: freq=noraman
keyword: PBEPBE/SDD
title: #p freq=noraman PBEPBE/SDD
converged: YES YES NO NO
title: Mulliken charges:
elementType: O O N N C C C C C C C C C C C C C C C H H H H H H H H H H H H H H H H H H
charge: -0.322037 -0.322468 -0.376135 -0.376049 -0.671147 0.327302 0.327467 -0.041229 -0.040312 0.301046 0.301412 -0.403190 -0.402726 0.134593 0.135684 -0.815376 -0.816515 -0.763353 -0.764790 0.259214 0.259556 0.373006 0.372458 0.266889 0.266934 0.230873 0.222354 0.224768 0.225295 0.230986 0.222751 0.232178 0.232043 0.251436 0.232874 0.232694 0.251517
chargesum: 0.00000
title: Mulliken charges with hydrogens summed into heavy atoms:
elementType: O O N N C C C C C C C C C C C C C C C
charge: -0.322037 -0.322468 -0.003130 -0.003591 -0.152378 0.327302 0.327467 -0.041229 -0.040312 0.301046 0.301412 -0.136301 -0.135791 0.134593 0.135684 -0.137381 -0.137484 -0.047696 -0.047706
polarizability: 2.28526561e+02 -5.82741680e+00 2.01364395e+02 -2.31847778e-02 1.25696077e-03 1.19954119e+02
1716.lowfreq: -10.5430 0.0004 0.0005 0.0007 5.0197 5.8423 39.6709 46.5613 68.7476
frequency: 39.6117 46.5606 68.7434 97.0614 102.3874 112.7059 117.3770 124.7047 143.6745 152.6908 212.6148 214.2557 217.5726 220.4169 237.3735 245.7860 301.8447 308.2227 314.6876 338.3996 352.4691 406.2102 407.6876 518.1819 529.6639 549.0253 559.9185 580.1835 581.0547 626.5445 630.0150 647.1281 659.3886 715.2894 715.4617 761.4562 769.9801 773.7514 787.3287 843.1041 854.0433 903.8718 941.1262 943.6440 985.5188 986.8499 1010.9924 1016.6884 1023.3406 1041.8604 1042.6123 1045.0296 1060.0739 1062.1507 1117.5008 1129.5229 1167.1213 1251.8861 1255.1274 1270.3886 1272.6177 1322.9887 1364.1598 1364.2932 1374.8546 1377.1728 1386.3311 1391.1464 1404.8558 1405.4602 1429.9298 1436.0450 1443.3924 1453.5297 1454.0253 1461.3439 1471.3016 1475.8592 1475.9644 1484.3130 1488.7635 1515.1242 1516.3394 1527.7259 1540.0770 1576.5636 1582.8745 2971.3073 2971.5986 2988.3855 2988.6770 3024.1126 3046.4335 3046.7699 3075.9697 3076.0524 3076.9363 3077.0029 3088.6134 3120.5944 3120.6922 3229.2162 3229.3319 3386.0227 3398.5400
redmass: 3.6598 4.0144 3.2818 2.4477 1.8012 1.9152 2.9836 1.4803 4.1939 6.2794 1.4270 1.1572 2.2804 3.9236 3.3348 3.2290 2.8632 4.0763 3.2471 4.7184 2.8414 3.0082 5.5257 3.2135 3.8446 3.8001 2.9527 3.9223 3.4283 3.1904 3.5238 3.7057 3.6485 5.1119 5.3586 3.6196 1.5627 1.4045 2.2664 1.2349 1.4725 1.8431 2.3856 2.2427 1.7800 1.6605 2.0222 1.7789 1.9527 1.5864 1.5067 2.3156 2.8477 2.8688 1.8017 1.7119 1.2960 1.6580 1.7079 3.6489 4.4249 1.5900 1.3788 1.2953 2.0328 2.2006 5.4085 3.4652 1.3390 1.4005 1.2423 1.1560 1.1190 1.0679 1.0620 3.2637 1.8858 1.0508 1.0496 1.2832 1.6168 4.8364 5.0993 3.9523 4.9549 4.5480 4.2185 1.0375 1.0374 1.0368 1.0367 1.0589 1.0974 1.0975 1.0971 1.0971 1.0969 1.0971 1.1024 1.1004 1.1004 1.0987 1.0987 1.0848 1.0848
irintensity: 1.3060 0.7107 0.1800 15.6731 5.9349 2.2646 7.1912 1.8904 0.7988 0.1565 2.4495 2.1824 11.0558 7.6887 4.5851 0.3793 10.3971 0.9038 2.8134 0.1079 4.5307 3.6776 0.0040 8.9028 1.9015 1.1044 3.1396 29.9128 6.0544 0.9854 2.8681 10.3456 0.8658 0.7425 2.5982 47.2152 21.0607 25.9133 80.0485 174.8632 66.0137 3.4402 1.6932 66.6461 0.2547 6.4342 0.0293 1.0638 10.5313 1.1843 8.6815 2.0543 47.4845 0.9613 0.1879 37.4489 0.2468 80.9800 9.1313 36.9314 2.2058 10.5108 70.9762 11.2573 91.9988 1.3977 50.4085 0.5286 9.6744 9.8211 25.1099 133.5319 4.8379 5.5143 8.0630 194.6361 1.2783 8.9925 48.9389 21.8932 0.0840 124.9530 2.2191 2.8332 324.3631 181.5251 12.5536 67.0210 29.6375 6.7481 5.9240 10.8513 24.1502 24.3255 23.0278 24.8376 10.9195 24.5748 2.3281 10.9335 18.8369 2.0346 1.7082 141.0679 530.0757
temp: 298.150 k
press: 1.00000 atm
elementType: 8 8 7 7 6 6 6 6 6 6 6 6 6 6 6 6 6 6 6 1 1 1 1 1 1 1 1 1 1 1 1 1 1 1 1 1 1
symmnumber: 1
zpe: 789853.5 jmol-1
zpe.correction: 0.300839 hartree
zpe.thermalcorrener: 0.319873 hartree
zpe.thermalcorrenthalpy: 0.320817 hartree
zpe.thermalcorrgfe: 0.253973 hartree
zpe.sumelectzpe: -840.988145 hartree
zpe.sumelectthermal: -840.969112 hartree
zpe.sumelectthermalent: -840.968168 hartree
zpe.sumelectthermalfe: -841.035011 hartree
dipole: 0.0417 0.0163 1.6176
dipole: 1.6182
quadrupole: -94.9754 -112.1112 -112.0966
quadrupole: 3.8331 -0.0169 -0.0023
quadrupole: 11.4189 -5.7168 -5.7022 3.8331 -0.0169 -0.0023
hfenergy: -841.2889847 hartree
pointgroup: C01 [X(C15H18N2O2)]
dipole: -0.0085673 -0.6237498 0.1271789 debye
polarizability: 227.5782732|-5.5972067|123.2374324|-6.4255279|15.6789755|199.0293697 unknown
InChI: InChI=1S/C15H18N2O2/c1-8-6-16-12(14(8)10(3)18)5-13-15(11(4)19)9(2)7-17-13/h6-7,16-17H,5H2,1-4H3
charge 0 multiplicity 1
37 atoms
O  -1.664251 1.2694 2.363983
O  1.718779 0.247609 -2.169434
N  -1.084323 0.057929 -1.671199
N  1.119939 0.687783 2.020544
C  0.063465 1.589418 -0.06062
C  -1.082386 0.691976 -0.45268
C  1.14355 0.81774 0.653186
C  -2.28147 0.338591 0.231511
C  2.298697 0.140209 0.165228
C  -3.033831 -0.542799 -0.668177
C  2.997027 -0.397649 1.337986
C  -2.251529 -0.701679 -1.814308
C  2.227036 -0.053371 2.451102
C  -2.573082 0.772066 1.60078
C  2.599845 0.006378 -1.262999
C  -4.36708 -1.217839 -0.454332
C  4.267658 -1.209721 1.408067
C  -3.985686 0.629594 2.159528
C  3.988827 -0.44126 -1.708045
H  0.490682 2.051609 -0.9662
H  -0.314587 2.385577 0.601949
H  -0.238142 0.07576 -2.262587
H  0.292751 0.995694 2.55532
H  -2.441042 -1.294383 -2.706596
H  2.386622 -0.28232 3.502525
H  -4.629719 -1.832472 -1.333161
H  -4.358623 -1.888251 0.426233
H  -5.186315 -0.490618 -0.30205
H  5.137687 -0.66507 0.996408
H  4.501898 -1.463461 2.456785
H  4.185318 -2.161835 0.849616
H  -4.236782 -0.437341 2.308658
H  -4.738545 1.049717 1.469561
H  -4.03938 1.144375 3.131394
H  4.165934 -1.495544 -1.42452
H  4.779986 0.163156 -1.23006
H  4.059969 -0.351968 -2.803196
