program: Gaussian 09
title: 000281671
version: EM64L-G09RevD.01
frameworkgroup: C1[X(C16H19NO5)]
method: RPBEPBE
basis: SDD
operation: Freq
keyword: #p
keyword: freq=noraman
keyword: PBEPBE/SDD
title: #p freq=noraman PBEPBE/SDD
converged: NO YES NO NO
title: Mulliken charges:
elementType: O O O O O N C C C C C C C C C C C C C C C C H H H H H H H H H H H H H H H H H H H
charge: -0.255341 -0.231173 -0.290269 -0.407870 -0.240314 -0.614108 0.132179 -0.122411 0.112958 -0.494531 -0.507315 -0.576281 0.329038 -0.564248 0.149401 0.077754 -0.352441 -0.395946 0.156341 -0.371842 0.169337 -0.519273 0.201696 0.239151 0.238349 0.238181 0.218541 0.231457 0.228847 0.298916 0.252800 0.242505 0.220421 0.234020 0.250358 0.334118 0.316167 0.379197 0.253869 0.213445 0.224318
chargesum: 0.00000
title: Mulliken charges with hydrogens summed into heavy atoms:
elementType: O O O O O N C C C C C C C C C C C C C C C C
charge: -0.255341 -0.231173 -0.290269 -0.028673 -0.240314 0.036177 0.132179 0.079285 0.112958 -0.017031 -0.050593 -0.115976 0.329038 -0.012533 0.149401 0.077754 0.110484 -0.161926 0.156341 -0.121484 0.169337 0.172359
polarizability: 2.29765534e+02 8.45333306e+00 1.87137994e+02 1.32482478e+01 -1.60498381e+01 1.50395672e+02
1716.lowfreq: -14.6663 -4.7992 -0.0010 -0.0009 0.0005 8.6192 27.4827 34.1454 39.4894
frequency: 27.3732 34.1112 39.4521 42.2707 67.5115 83.6379 100.2431 111.9695 140.4836 159.6243 183.9930 191.3337 200.8055 228.1104 249.5725 288.8746 305.3065 329.9298 336.6762 340.9023 363.3142 381.9980 412.9314 453.6180 468.1926 488.9634 506.5573 518.3202 521.4540 532.0529 553.7598 572.4612 580.8235 608.0588 619.6220 630.4308 648.6369 663.6665 697.1673 733.7477 749.1127 779.1551 812.6644 828.6208 846.1899 857.8726 881.1867 899.0529 918.7930 938.8476 948.5710 971.5088 986.8017 1011.5981 1033.8052 1040.7326 1058.1870 1070.7525 1083.0416 1098.4328 1110.0106 1119.6902 1133.3069 1150.5792 1154.1429 1161.7360 1196.5921 1201.8612 1215.6059 1219.4381 1231.4937 1248.5854 1258.2230 1264.8826 1294.3965 1303.9301 1325.6022 1334.4803 1341.9317 1350.4490 1365.6433 1373.6473 1380.7084 1416.3558 1425.6820 1439.4020 1451.7867 1453.4890 1464.7039 1478.3642 1481.5506 1484.8622 1487.7167 1577.4700 1585.5131 1602.2659 1628.3156 1657.2308 2960.9298 2973.4657 2983.5594 2997.6535 2999.9316 3002.6462 3008.1246 3020.3659 3058.4843 3061.8778 3078.7185 3082.2471 3087.6200 3121.1531 3122.7446 3164.9669 3505.6897 3513.0708 3664.9708
redmass: 8.1016 5.6512 5.1707 5.8126 2.4198 4.6618 2.4309 4.6802 4.8164 1.5556 5.3566 3.3995 2.9064 3.1882 4.6054 4.6352 2.2756 3.0405 3.8844 3.7949 4.6209 4.0687 4.7417 3.4950 4.3595 3.9363 1.5624 1.7513 3.6849 3.7908 3.4663 3.3993 1.6075 2.6285 2.7510 2.9935 2.3575 1.9838 4.3967 5.0053 4.5675 2.9580 1.6386 2.6219 2.5441 3.0983 3.6838 3.2377 2.4056 1.4687 1.9849 3.3800 3.0850 2.5761 3.0953 2.1168 2.2918 2.3173 2.1544 2.9571 1.2401 2.0812 2.5820 1.3773 1.3749 1.4077 2.1789 1.4160 1.4310 1.3707 1.5601 1.4226 3.1861 2.1851 2.6917 1.4887 1.8890 1.9550 1.4069 1.4409 1.5080 4.1053 1.5172 2.8853 1.2952 1.0935 1.0906 1.0825 1.2821 1.1415 1.1194 1.8070 1.0848 1.9022 6.5180 7.3076 2.4593 8.0600 1.0657 1.0336 1.0793 1.0622 1.0626 1.0697 1.0645 1.0886 1.1021 1.1006 1.0985 1.0930 1.1038 1.1041 1.0891 1.0951 1.0639 1.0446 1.1038
irintensity: 0.4486 0.8479 2.5469 6.6281 5.1849 7.6490 0.0263 0.7336 0.8348 2.6404 2.4548 4.4901 2.7103 0.0140 0.6832 6.4377 1.2986 3.6488 0.9283 5.2669 0.5824 2.1056 10.2161 1.0574 8.3483 14.2461 47.8477 73.5615 7.4909 27.9834 45.7970 7.2866 83.4997 17.5657 5.1218 7.4289 36.5784 96.2691 4.2834 10.0471 7.2847 15.1643 22.3334 12.0599 7.9867 13.4725 13.7426 15.4198 13.9384 5.0796 10.7307 35.6483 13.8474 15.5048 56.5045 10.7512 227.8429 10.5511 32.7191 41.0393 8.5325 3.2748 10.6730 5.6471 5.1788 6.2903 60.8168 3.4145 39.4519 2.3950 18.3493 22.1319 82.2022 47.5305 100.8876 18.1883 29.0768 53.1819 24.0371 4.2484 7.9339 2.5107 50.1543 42.0219 5.4565 23.8758 7.8255 10.5635 28.1117 8.5090 55.2245 49.2697 16.7122 69.1081 19.8893 6.8180 208.2991 210.2518 31.2453 86.7183 22.9652 6.6998 29.4041 35.8432 44.7215 32.9504 29.8142 40.7352 34.9419 5.2335 27.8091 24.8113 14.0182 11.3168 25.0731 26.1039 30.4042
temp: 298.150 k
press: 1.00000 atm
elementType: 8 8 8 8 8 7 6 6 6 6 6 6 6 6 6 6 6 6 6 6 6 6 1 1 1 1 1 1 1 1 1 1 1 1 1 1 1 1 1 1 1
symmnumber: 1
zpe: 861387.5 jmol-1
zpe.correction: 0.328085 hartree
zpe.thermalcorrener: 0.348798 hartree
zpe.thermalcorrenthalpy: 0.349742 hartree
zpe.thermalcorrgfe: 0.277743 hartree
zpe.sumelectzpe: -1050.339109 hartree
zpe.sumelectthermal: -1050.318396 hartree
zpe.sumelectthermalent: -1050.317452 hartree
zpe.sumelectthermalfe: -1050.389452 hartree
dipole: 3.7602 2.3759 -1.0038
dipole: 4.5597
quadrupole: -129.4894 -117.0126 -128.7605
quadrupole: -4.9141 -0.8606 -7.7095
quadrupole: -4.4019 8.0749 -3.6730 -4.9141 -0.8606 -7.7095
hfenergy: -1050.6671946 hartree
pointgroup: C01 [X(C16H19N1O5)]
dipole: -1.5104305 0.9177424 0.3074727 debye
polarizability: 230.3850663|-5.5696474|189.5654108|13.0709179|12.5124404|147.3487225 unknown
InChI: InChI=1S/C16H19NO5/c1-21-11-5-3-9-2-4-10(8-12(18)19)16(15(17)20)6-7-22-14(11)13(9)16/h3,5,10,18H,2,4,6-8,17H2,1H3
charge 0 multiplicity 1
41 atoms
O  2.213782 0.961682 1.238558
O  0.847198 2.081175 -1.8724
O  4.047448 -1.12867 0.838464
O  -3.980142 -2.097397 1.703853
O  -4.700617 -0.204631 0.573365
N  -1.205447 2.993913 -1.359522
C  -0.461466 0.97317 -0.057097
C  -1.925383 0.420393 -0.138934
C  0.544225 -0.175165 -0.233567
C  -2.095327 -0.289425 -1.507127
C  -0.154008 1.709284 1.286283
C  -1.164292 -1.516768 -1.628758
C  0.2162 -1.325889 -1.002313
C  -2.286642 -0.514938 1.042123
C  -0.217783 2.033363 -1.192494
C  1.822907 -0.09056 0.385209
C  1.318478 2.13404 1.328176
C  1.172668 -2.357639 -1.149966
C  2.786614 -1.124995 0.210879
C  2.446449 -2.254579 -0.559866
C  -3.758233 -0.879346 1.047714
C  4.92717 0.032407 0.589085
H  -2.645296 1.262147 -0.088961
H  -1.863301 0.435605 -2.309373
H  -3.148214 -0.592505 -1.650703
H  -0.339548 1.031523 2.13918
H  -0.801262 2.598286 1.407069
H  -1.050093 -1.783476 -2.69698
H  -1.644176 -2.39699 -1.153089
H  -1.678336 -1.434066 1.049456
H  -2.096259 -0.013987 2.01189
H  1.568602 2.825355 0.502065
H  1.578571 2.604259 2.29048
H  0.918793 -3.245586 -1.740913
H  3.200306 -3.039257 -0.676623
H  -1.049543 3.714964 -2.064213
H  -2.099036 2.966426 -0.872705
H  -4.958435 -2.285163 1.727004
H  4.487234 0.95651 0.99859
H  5.110869 0.151137 -0.496473
H  5.869326 -0.210007 1.104633
