program: Gaussian 09
title: 000281638
version: EM64L-G09RevD.01
frameworkgroup: C1[X(C8H13NO3)]
method: RPBEPBE
basis: SDD
operation: Freq
keyword: #p
keyword: freq=noraman
keyword: PBEPBE/SDD
title: #p freq=noraman PBEPBE/SDD
converged: YES YES NO NO
title: Mulliken charges:
elementType: O O O N C C C C C C C C H H H H H H H H H H H H H
charge: -0.226527 -0.232414 -0.433366 -0.189142 -0.414030 -0.487736 -0.490927 -0.357694 0.200097 0.203227 -0.387866 -0.324530 0.226386 0.230096 0.262321 0.237416 0.236609 0.261834 0.240157 0.247287 0.219883 0.238760 0.222329 0.186129 0.331700
chargesum: 0.00000
title: Mulliken charges with hydrogens summed into heavy atoms:
elementType: O O O N C C C C C C C C
charge: -0.226527 -0.232414 -0.101665 -0.189142 0.042452 0.012002 0.007516 0.129750 0.200097 0.203227 0.070776 0.083928
polarizability: 1.15118779e+02 7.99430855e-01 1.09163282e+02 5.21834228e+00 -1.14107180e+00 7.50822872e+01
1716.lowfreq: -7.4157 -6.8218 -0.0006 -0.0005 -0.0001 6.3652 36.3677 61.1459 72.1217
frequency: 36.3112 61.1417 72.1136 89.0914 109.1692 120.5614 215.9899 237.5370 294.8393 318.4895 352.5605 418.0982 436.2596 437.9914 485.5373 542.6697 551.2676 597.7095 644.8153 709.1435 761.2912 846.2130 857.2691 879.4358 920.2468 951.6647 969.6899 1040.4869 1052.3489 1060.5379 1064.5208 1091.8556 1100.4010 1130.8261 1158.7111 1202.3257 1247.4439 1256.5604 1268.3860 1293.1628 1310.7557 1321.8211 1326.3042 1336.1675 1346.2485 1354.9305 1381.7236 1386.6518 1441.7673 1446.9610 1452.8695 1467.9619 1480.1711 1483.8167 1587.7885 1631.2078 2951.3039 2985.0336 2987.2638 2992.6971 3006.2512 3035.7666 3053.9520 3067.1245 3077.4284 3078.7427 3082.5851 3105.5539 3560.8121
redmass: 5.8336 4.8361 1.7364 2.7502 4.1877 4.0253 3.5238 2.8285 2.5794 1.2761 2.5799 5.8116 4.0697 4.1252 4.2598 4.3491 2.6322 3.5079 5.6081 3.2947 1.1320 1.3714 1.5424 2.3333 2.5430 2.5169 4.1918 3.3719 2.8121 2.0448 1.8436 3.8634 1.5349 1.5671 1.6944 1.4921 1.2738 1.6106 1.3829 1.1052 4.1540 1.3727 1.6184 1.3913 1.3225 1.5736 1.3847 1.2500 1.0789 1.0920 1.0921 1.0762 1.0861 1.0907 11.1584 9.6522 1.0688 1.0682 1.0670 1.0610 1.0612 1.0598 1.0947 1.1002 1.0997 1.0936 1.0965 1.1059 1.0662
irintensity: 0.2520 4.4722 3.8444 0.1392 10.4283 4.0187 1.3493 2.9604 38.9987 134.7530 8.0811 30.4808 3.0814 2.5025 0.2233 11.0288 12.3332 8.7824 2.6399 5.9410 12.9645 4.3740 0.7005 10.2109 9.1293 30.8377 63.8140 15.0962 28.6318 6.7730 55.1289 1.1129 23.1510 99.9008 45.5772 5.5716 7.1736 70.3296 37.1753 0.6751 146.0825 5.1100 7.0656 28.8714 9.0946 57.1007 8.9794 23.1513 5.9460 39.7049 6.9645 2.6087 14.9449 9.3919 390.3155 52.9271 65.9185 7.7540 6.6749 15.9709 37.1258 20.5130 9.3889 31.4567 30.1479 10.2012 12.4166 7.7337 7.4345
temp: 298.150 k
press: 1.00000 atm
elementType: 8 8 8 7 6 6 6 6 6 6 6 6 1 1 1 1 1 1 1 1 1 1 1 1 1
symmnumber: 1
zpe: 542065.9 jmol-1
zpe.correction: 0.206462 hartree
zpe.thermalcorrener: 0.218828 hartree
zpe.thermalcorrenthalpy: 0.219773 hartree
zpe.thermalcorrgfe: 0.166638 hartree
zpe.sumelectzpe: -592.148131 hartree
zpe.sumelectthermal: -592.135764 hartree
zpe.sumelectthermalent: -592.134820 hartree
zpe.sumelectthermalfe: -592.187955 hartree
dipole: 4.2814 -1.4509 0.5580
dipole: 4.5548
quadrupole: -71.0917 -85.5842 -68.0434
quadrupole: 5.0208 4.4921 -2.8380
quadrupole: 3.8148 -10.6778 6.8630 5.0208 4.4921 -2.8380
hfenergy: -592.3545929 hartree
pointgroup: C01 [X(C8H13N1O3)]
dipole: 1.6975583 -0.5193128 0.244763 debye
dipolederiv: -0.594494 0.2611678 -0.0783711 0.0084634 -1.084187 0.0593129 -0.0917457 0.1231433 -0.3571951 -0.6291487 -0.2944046 -0.062205 -0.0472315 -1.0685404 -0.0134137 -0.0873672 -0.0795349 -0.3496186 -0.8752281 -0.1716779 0.1182461 -0.2102353 -0.2053424 -0.0822992 0.1997375 -0.0966115 -0.5966468 -0.7614105 -0.0441874 -0.094249 -0.0385362 -1.6088264 0.0484776 -0.1468293 0.0465152 -0.253345 0.0793632 -0.0007896 0.0048497 -0.0009874 0.0239675 0.0036983 -0.0196854 0.0033464 0.1440528 -0.2030617 -0.0042361 -0.1155105 -0.0304679 -0.0017044 -0.0071436 -0.1770564 -0.003875 0.0581948 -0.2030934 0.0051337 -0.1142623 0.0270368 0.000109 0.0171149 -0.1792157 0.0166867 0.0547752 0.4346541 -0.002894 0.0369129 -0.0225508 0.0920568 0.0113066 0.0417806 0.0134585 0.2289733 0.8561136 0.2361239 0.2258841 0.2643996 1.7067379 -0.0201269 0.2751794 0.0352076 0.2512552 0.8453314 -0.1710133 0.2339653 -0.1769165 1.6894432 -0.0780016 0.2827552 -0.1344964 0.2574287 -0.2375403 -0.024289 0.0001296 0.0094101 0.1149298 -0.0253382 -0.0808006 0.0039058 -0.0458587 0.661846 0.0649434 -0.1506866 0.0930841 0.3042028 0.0115157 -0.0819126 0.0222209 0.5096594 0.0941347 -0.0008268 0.0169062 0.0008633 0.0285864 -0.0056273 0.0861508 -0.0072114 -0.137258 -0.1690332 0.0034199 -0.0774207 0.0027535 0.0720127 0.0015497 -0.1151259 0.0023729 0.053644 0.031261 -0.0368249 0.0083402 -0.0522078 -0.05781 0.0449632 0.04583 0.0650886 0.0954053 0.0379807 0.0173673 0.0267654 0.0386068 0.0946185 0.0122993 0.0132996 -0.0413653 -0.0912264 0.0351931 -0.013052 0.0268591 -0.0344408 0.0975333 -0.0242047 0.0170411 0.0292748 -0.093291 0.0357912 0.0314923 0.0041533 0.0495732 -0.0693032 -0.0356062 0.0398602 -0.0575671 0.1012656 0.0295398 -0.0040511 -0.0030154 -0.0448808 0.0107732 -0.124432 0.0117029 -0.0541636 0.0170549 0.0501139 0.0046687 0.0066947 0.0570977 0.0181185 0.113184 0.0162563 0.0479878 0.0387938 0.0536125 0.028386 -0.0071384 -0.0087855 -0.0578335 0.1207977 -0.0246548 0.0747087 -0.0054512 0.0509478 -0.0365144 -0.0206666 -0.0173773 -0.0221498 -0.0994038 -0.0323851 -0.0777814 -0.0144161 0.0372857 0.0157992 0.0033546 0.0384204 -0.0658832 0.1185691 -0.0070498 0.0755488 0.0008692 -0.0146179 -0.0087619 0.035236 -0.030897 -0.0791074 -0.1729282 0.0062588 -0.1130095 -0.1219211 0.3544592 0.1450209 -0.0247713 0.1258058 0.067598 0.1257364 0.007976 0.1061497 0.2548557 unknown
polarizability: 115.0979364|1.2117493|108.9938673|5.1113887|-2.8553845|75.2725446 unknown
InChI: InChI=1S/C8H13NO3/c10-6-2-5-9-7(11)3-1-4-8(9)12/h10H,1-6H2
charge 0 multiplicity 1
25 atoms
O  0.399329 2.353973 -0.343357
O  0.276953 -2.302076 -0.201593
O  -4.512563 -0.071493 0.784815
N  0.376522 0.021735 -0.33632
C  3.19673 -0.03856 0.064133
C  2.438017 1.249908 0.431289
C  2.372979 -1.261527 0.507537
C  -1.020256 0.03629 -0.858214
C  1.01265 1.277934 -0.109994
C  0.947267 -1.246716 -0.032276
C  -2.063924 -0.01276 0.279235
C  -3.499422 -0.008231 -0.279623
H  3.370968 -0.076243 -1.027805
H  4.187534 -0.049312 0.551841
H  2.939531 2.15665 0.053876
H  2.379734 1.356579 1.533921
H  2.311539 -1.297448 1.614585
H  2.825977 -2.2143 0.18631
H  -1.133474 -0.841857 -1.516695
H  -1.137174 0.962578 -1.444354
H  -1.902817 -0.932803 0.874961
H  -1.936194 0.858351 0.947281
H  -3.713477 0.940241 -0.80099
H  -3.633262 -0.843625 -1.001579
H  -4.388869 -0.913986 1.291118
