program: Gaussian 09
title: 000281626
version: EM64L-G09RevD.01
frameworkgroup: C1[X(C8H15NO3)]
method: RPBEPBE
basis: SDD
operation: Freq
keyword: #p
keyword: freq=noraman
keyword: PBEPBE/SDD
title: #p freq=noraman PBEPBE/SDD
converged: YES YES NO NO
title: Mulliken charges:
elementType: O O O N C C C C C C C C H H H H H H H H H H H H H H H
charge: -0.410728 -0.261706 -0.228392 -0.380871 0.112725 -0.421524 -0.373600 0.217972 0.136485 -0.687207 -0.711616 -0.613846 0.186107 0.232955 0.187321 0.227185 0.252726 0.218142 0.207929 0.255180 0.204671 0.232963 0.307999 0.225797 0.279168 0.225260 0.378904
chargesum: 0.00000
title: Mulliken charges with hydrogens summed into heavy atoms:
elementType: O O O N C C C C C C C C
charge: -0.031824 -0.261706 -0.228392 -0.072872 0.112725 -0.002462 0.040907 0.217972 0.136485 -0.008410 -0.018802 0.116379
polarizability: 1.11365113e+02 -6.14082571e+00 9.94737155e+01 3.67490265e+00 -4.60370615e-01 9.37832643e+01
1716.lowfreq: -14.5757 0.0005 0.0006 0.0007 4.0809 9.4709 26.5183 72.4566 89.0451
frequency: 26.1003 72.4069 89.0076 109.9812 113.1109 138.1546 153.9246 189.4840 198.8518 212.5392 237.7804 256.1297 268.1600 322.3874 340.1637 369.1796 393.4698 474.9468 498.5955 558.4880 567.7270 615.4427 696.0667 711.3641 735.6122 776.9368 792.1945 894.2123 929.5809 940.7257 1034.0302 1042.5216 1043.8993 1075.3990 1081.5844 1109.3864 1121.8945 1134.5007 1159.5072 1171.3883 1226.9018 1255.8218 1277.9599 1305.8702 1334.3827 1346.6365 1398.7357 1400.0020 1415.8322 1446.4672 1456.3826 1471.2433 1473.3801 1480.2423 1487.0227 1487.9956 1493.2794 1514.0069 1607.9102 1647.1367 2953.7210 2978.5527 2979.5704 2992.2131 2993.7251 3016.0592 3041.9709 3057.8734 3079.0607 3082.4225 3106.7369 3110.1424 3111.0396 3511.6789 3561.2304
redmass: 5.1096 5.2638 2.3164 1.0715 2.2299 2.9347 2.0648 2.7308 1.7423 2.2681 2.9524 2.7938 1.6436 2.6852 5.2623 4.2061 4.4395 3.0217 3.9079 1.1473 1.4972 2.5716 4.1766 4.2482 2.1880 1.3084 2.1006 1.9350 2.1167 3.3990 3.0785 1.5319 2.4337 2.2651 2.1762 2.9376 1.3330 1.6559 2.8119 2.1663 2.1237 1.1678 1.5656 1.3802 1.7319 1.3814 1.2017 1.2042 1.1839 1.1529 1.2332 1.0443 1.0454 1.0701 1.0480 1.0462 1.0623 1.3911 7.3298 8.8074 1.0653 1.0350 1.0599 1.0380 1.0377 1.0953 1.1000 1.1025 1.0993 1.0989 1.1001 1.0981 1.0980 1.0639 1.0772
irintensity: 3.0316 2.7607 0.6216 0.1103 0.3216 2.1420 1.9904 2.1056 1.5108 1.7301 3.0544 1.7937 1.3160 2.5035 7.2123 6.7354 6.8401 8.5307 40.3331 81.8711 97.2448 32.5320 16.7892 0.7277 29.8529 2.7839 8.5330 12.7254 27.3454 2.9275 15.5486 47.7688 111.5473 0.7016 7.9034 36.4054 0.6865 50.4324 15.2499 32.3276 50.2170 0.6258 11.0588 2.9633 16.2729 3.2613 31.5193 7.3552 29.5886 28.0936 72.5233 2.6564 11.0701 12.4624 8.3610 16.2196 14.4929 106.4053 176.1905 204.1207 29.6949 74.2183 39.0142 41.9992 20.5744 15.9339 16.7302 34.5945 34.2410 38.9310 19.5322 22.7457 1.4168 25.5207 12.5485
temp: 298.150 k
press: 1.00000 atm
elementType: 8 8 8 7 6 6 6 6 6 6 6 6 1 1 1 1 1 1 1 1 1 1 1 1 1 1 1
symmnumber: 1
zpe: 590716.2 jmol-1
zpe.correction: 0.224992 hartree
zpe.thermalcorrener: 0.239551 hartree
zpe.thermalcorrenthalpy: 0.240495 hartree
zpe.thermalcorrgfe: 0.183699 hartree
zpe.sumelectzpe: -593.323616 hartree
zpe.sumelectthermal: -593.309058 hartree
zpe.sumelectthermalent: -593.308113 hartree
zpe.sumelectthermalfe: -593.364909 hartree
dipole: -2.4342 2.3456 -3.1125
dipole: 4.5951
quadrupole: -69.3753 -73.3818 -72.0128
quadrupole: 3.2502 5.4555 2.7992
quadrupole: 2.2147 -1.7918 -0.4229 3.2502 5.4555 2.7992
hfenergy: -593.5486082 hartree
pointgroup: C01 [X(C8H15N1O3)]
dipole: 0.8284033 -1.0340875 -1.2299218 debye
polarizability: 109.3108326|-7.6348993|101.6421629|-3.3705884|1.0416358|93.6690971 unknown
InChI: InChI=1S/C8H15NO3/c1-4-8(5-2,7(11)12)6(10)9-3/h9,11H,4-5H2,1-3H3
charge 0 multiplicity 1
27 atoms
O  -1.595381 -0.898179 1.387465
O  0.903001 0.651425 1.52485
O  -2.613159 0.904702 0.364503
N  2.023023 -0.331925 -0.257708
C  -0.41443 0.116409 -0.496048
C  -0.538497 -1.116685 -1.46779
C  -0.433737 1.418903 -1.374895
C  0.878949 0.139125 0.366146
C  -1.63518 0.128874 0.442037
C  -0.394802 -2.529551 -0.863069
C  -0.224121 2.749991 -0.625332
C  3.34112 -0.278477 0.3871
H  0.209979 -0.977117 -2.276903
H  -1.520181 -1.031246 -1.974529
H  0.348656 1.303815 -2.151774
H  -1.410039 1.446529 -1.895135
H  -1.191327 -2.736876 -0.131307
H  0.569397 -2.655678 -0.339009
H  -0.452354 -3.288157 -1.665438
H  -1.011824 2.90472 0.130118
H  -0.268136 3.590644 -1.341979
H  0.75236 2.787288 -0.112078
H  1.948552 -0.74999 -1.185281
H  3.758993 -1.291942 0.532974
H  3.206343 0.19597 1.37212
H  4.053924 0.322631 -0.20719
H  -2.381131 -0.810106 1.992756
