program: Gaussian 09
title: 000281630
version: EM64L-G09RevD.01
frameworkgroup: C1[X(C12H22O6)]
method: RPBEPBE
basis: SDD
operation: Freq
keyword: #pfreq=noraman
keyword: PBEPBE/SDD
title: #p freq=noraman PBEPBE/SDD
converged: YES YES NO NO
title: Mulliken charges:
elementType: O O O O O O C C C C C C C C C C C C H H H H H H H H H H H H H H H H H H H H H H
charge: -0.284354 -0.284221 -0.458157 -0.458415 -0.267901 -0.268289 0.328618 0.328735 -0.198226 -0.198064 -0.704223 -0.702792 -0.704006 -0.704373 -0.703213 -0.704028 0.273861 0.274043 0.259664 0.259578 0.221927 0.213825 0.266613 0.232781 0.228223 0.207433 0.262954 0.210111 0.241159 0.222029 0.213901 0.266547 0.232809 0.228371 0.207485 0.263124 0.210219 0.241073 0.372552 0.372623
chargesum: 0.00000
title: Mulliken charges with hydrogens summed into heavy atoms:
elementType: O O O O O O C C C C C C C C C C C C
charge: -0.284354 -0.284221 -0.085605 -0.085792 -0.267901 -0.268289 0.328618 0.328735 0.061438 0.061514 -0.001857 -0.034355 0.010219 -0.001897 -0.034547 0.010388 0.273861 0.274043
polarizability: 1.87965297e+02 1.32287545e-02 1.41543405e+02 4.23020232e+00 -6.69060106e-02 1.28422872e+02
1716.lowfreq: -15.2971 -1.5493 -0.0005 -0.0003 0.0007 5.3918 21.8080 25.7015 33.3725
frequency: 21.7932 25.6066 32.8958 51.8191 61.8597 105.1249 114.2241 125.7778 130.7988 162.2099 165.6000 175.9493 177.9857 214.9917 237.4502 239.3589 246.7995 250.2528 270.3997 291.4665 293.6063 305.7821 331.5617 333.9763 334.6587 355.3016 364.4073 410.4871 413.0160 430.5253 436.7524 453.3027 464.2766 477.6001 554.7276 584.4690 682.7910 707.9255 708.1833 762.9637 794.6987 806.0128 806.5888 841.2967 892.2980 917.6235 918.0788 922.9782 925.1671 957.5895 957.6737 971.7326 1024.9721 1030.5243 1030.5689 1036.1909 1036.2680 1052.4284 1144.3464 1160.8878 1178.6742 1207.2380 1224.1845 1247.1836 1257.4292 1257.8813 1264.5033 1274.0531 1274.9620 1314.9004 1366.8155 1380.7553 1381.0543 1381.7456 1382.9031 1385.7883 1405.8047 1406.2682 1446.2399 1446.3109 1465.0812 1465.7974 1468.0837 1468.3197 1471.8845 1472.0865 1479.9436 1480.0041 1501.2803 1501.7162 1613.8201 1614.4043 2991.5284 2991.6164 2993.6843 2993.7549 2998.5541 2998.7557 3032.5931 3044.7880 3083.3755 3083.9250 3089.2711 3089.5776 3098.0028 3098.1899 3100.5558 3101.5975 3115.3744 3115.4094 3119.5883 3120.2247 3449.5110 3452.0075
redmass: 4.3431 3.0928 3.4251 4.4500 4.8215 6.7476 5.6186 3.5163 4.1671 4.8625 3.8367 1.0849 1.0903 6.3074 1.0704 1.0486 1.0901 1.0914 2.7554 2.9301 3.1011 1.8126 3.2926 2.7062 3.6029 3.6337 2.0150 2.7393 2.4159 3.0364 2.6166 1.3639 2.7040 2.7306 7.9509 5.3891 5.1043 6.7899 6.9717 8.0363 5.2746 3.6504 3.2858 4.9828 4.4870 1.5866 1.5890 1.5940 1.7075 1.2049 1.2050 3.0220 4.8656 1.4255 1.4246 1.4452 1.4400 4.5313 2.5298 2.3680 1.2814 2.0445 2.7909 2.1868 2.8442 3.0175 1.2877 3.0486 3.0372 1.4167 1.2484 1.2370 1.2350 1.2663 1.2272 1.3974 1.2117 1.2115 1.0459 1.0459 1.0490 1.0490 1.0566 1.0570 1.0710 1.0702 1.0529 1.0526 1.0573 1.0573 9.0132 9.0412 1.0363 1.0361 1.0360 1.0359 1.0369 1.0369 1.0832 1.0853 1.0991 1.0992 1.0991 1.0992 1.0992 1.0991 1.1004 1.1005 1.1002 1.1003 1.0997 1.0997 1.0648 1.0645
irintensity: 1.1141 0.2735 2.8588 0.6401 0.1525 5.7239 0.1439 2.8276 0.0080 1.4537 0.3267 0.1811 0.1911 1.6003 2.2893 0.5226 0.0684 0.2665 39.9610 0.0450 3.6332 92.8811 4.8982 5.2762 29.2359 0.1084 125.4625 5.2946 5.7524 0.2293 3.9310 13.4686 6.8014 0.7666 25.0664 32.4461 10.4911 16.1641 36.2620 6.4851 0.8537 39.2871 5.0001 6.9757 3.1043 0.3634 0.8524 1.2628 0.1385 0.1676 0.1486 1.0038 173.4480 0.1053 0.0868 3.7424 2.3289 157.3055 704.1481 109.2337 93.9045 25.7411 242.0819 87.6219 8.8190 43.9012 6.5129 12.5238 6.6942 8.0639 22.0247 15.0670 75.4689 6.0449 11.0684 113.1751 45.7681 1.0537 1.1404 0.8342 3.8218 3.4860 1.2124 1.5168 17.7793 27.5870 5.5900 4.9167 34.5556 20.8594 156.8841 148.6281 15.0316 14.3357 12.4918 18.1234 33.3982 13.9948 2.8868 26.2380 10.6094 10.7969 7.7246 5.1724 108.2360 5.7850 29.3058 28.1669 5.2865 6.8197 15.1737 14.7453 88.4568 19.5260
temp: 298.150 k
press: 1.00000 atm
elementType: 8 8 8 8 8 8 6 6 6 6 6 6 6 6 6 6 6 6 1 1 1 1 1 1 1 1 1 1 1 1 1 1 1 1 1 1 1 1 1 1
symmnumber: 1
zpe: 863617.7 jmol-1
zpe.correction: 0.328935 hartree
zpe.thermalcorrener: 0.351267 hartree
zpe.thermalcorrenthalpy: 0.352211 hartree
zpe.thermalcorrgfe: 0.277168 hartree
zpe.sumelectzpe: -920.375034 hartree
zpe.sumelectthermal: -920.352702 hartree
zpe.sumelectthermalent: -920.351758 hartree
zpe.sumelectthermalfe: -920.426800 hartree
dipole: -0.0067 3.6906 -0.0084
dipole: 3.6906
quadrupole: -85.2269 -110.3471 -112.8260
quadrupole: 0.0257 4.0514 -0.0365
quadrupole: 17.5731 -7.5471 -10.0260 0.0257 4.0514 -0.0365
hfenergy: -920.7039684 hartree
pointgroup: C01 [X(C12H22O6)]
dipole: -0.0012805 -1.4512154 0.0478575 debye
polarizability: 188.0639809|-0.0734943|141.5266409|-3.4645399|-0.4759771|128.3409524 unknown
InChI: InChI=1S/C12H22O6/c1-11(2,3)17-9(15)7(13)8(14)10(16)18-12(4,5)6/h7-8,13-14H,1-6H3
charge 0 multiplicity 1
40 atoms
O  2.371674 -0.673833 0.111721
O  -2.38016 -0.687106 -0.149312
O  -0.317341 1.431666 1.397348
O  0.308666 1.317673 -1.587124
O  2.368453 1.44572 1.133775
O  -2.377355 1.349463 -1.327992
C  3.889526 -0.731075 -0.151116
C  -3.899342 -0.728006 0.109191
C  0.25591 0.30661 0.682226
C  -0.264347 0.250011 -0.788628
C  4.628171 -0.688704 1.199928
C  4.036913 -2.09454 -0.843857
C  4.267242 0.433568 -1.085486
C  -4.628597 -0.794014 -1.245875
C  -4.047197 -2.032457 0.9076
C  -4.285551 0.505973 0.945802
C  1.788445 0.428199 0.676372
C  -1.796921 0.370049 -0.793988
H  -0.044923 -0.626942 1.190502
H  0.03784 -0.719467 -1.22354
H  4.271627 -1.496147 1.863749
H  5.709603 -0.839058 1.027326
H  4.484607 0.280686 1.702332
H  3.455443 -2.12002 -1.781165
H  3.681127 -2.906758 -0.186973
H  5.099336 -2.277243 -1.084547
H  4.166492 1.40518 -0.577509
H  5.316999 0.310746 -1.408952
H  3.623258 0.435341 -1.981942
H  -4.268389 -1.651595 -1.841187
H  -5.71142 -0.929059 -1.069628
H  -4.479179 0.132661 -1.821756
H  -3.473688 -1.980338 1.84881
H  -3.682519 -2.893504 0.321559
H  -5.110885 -2.20007 1.153606
H  -4.185711 1.433943 0.361855
H  -5.336041 0.405071 1.274303
H  -3.645092 0.58161 1.841563
H  0.404508 2.114157 1.49435
H  -0.414388 1.988707 -1.73954
