program: Gaussian 09
title: 000281610
version: EM64L-G09RevD.01
frameworkgroup: C1[X(C5H7N3O)]
method: RPBEPBE
basis: SDD
operation: Freq
keyword: #pfreq=noraman
keyword: PBEPBE/SDD
title: #p freq=noraman PBEPBE/SDD
converged: NO YES NO NO
title: Mulliken charges:
elementType: O N N N C C C C C H H H H H H H
charge: -0.308092 -0.388271 -0.380029 -0.503191 0.255000 -0.348710 -0.214508 -0.270067 0.139131 0.341938 0.234423 0.256450 0.247646 0.327689 0.305288 0.305304
chargesum: 0.00000
title: Mulliken charges with hydrogens summed into heavy atoms:
elementType: O N N N C C C C C
charge: -0.308092 -0.046333 -0.052340 0.107401 0.255000 -0.114287 0.041942 -0.022421 0.139131
polarizability: 1.17983229e+02 -2.36776415e+00 7.84656094e+01 9.53483314e-03 1.20267062e-02 3.69274628e+01
1716.lowfreq: -18.1755 -5.6945 0.0008 0.0009 0.0009 3.8613 59.7752 109.6244 136.7171
frequency: 59.7679 109.6190 136.7016 145.4150 223.4792 280.2590 383.9505 481.7829 523.7909 603.8662 616.3566 707.2308 731.4766 741.0930 767.1685 817.4145 826.6505 879.5037 879.8896 946.9288 1046.0150 1064.8382 1099.7242 1132.8745 1229.0668 1263.8298 1285.3023 1321.0552 1409.6245 1417.6293 1438.7315 1458.5234 1536.5369 1589.4738 1679.5746 3201.5892 3220.5872 3245.2758 3394.3533 3509.7099 3562.0543 3563.0215
redmass: 3.1315 4.1338 1.2434 4.3588 4.2981 4.8098 5.3418 6.7049 1.2366 3.2997 3.4790 1.2079 2.7460 1.4117 1.6430 1.4300 7.4228 1.3496 5.6826 3.4704 1.4426 1.6404 2.6662 1.4053 3.4274 1.4592 1.1561 2.3627 3.2979 4.7560 3.8486 2.2994 4.2447 6.5816 1.0608 1.0932 1.0957 1.1074 1.0426 1.0990 1.0795 1.0809
irintensity: 1.5837 0.1485 28.0254 1.3728 3.9700 41.1577 1.6110 0.6096 137.0895 19.6307 18.8962 15.7761 93.1087 111.7899 119.5609 35.6806 28.3605 0.0180 4.0035 10.7640 22.2114 16.9038 69.5266 23.0846 19.1532 1.5438 0.0682 96.2251 11.2177 15.0152 10.5564 289.2631 54.6876 182.3908 31.1681 5.1237 3.4749 1.8567 0.1219 1.7073 54.4205 66.5152
temp: 298.150 k
press: 1.00000 atm
elementType: 8 7 7 7 6 6 6 6 6 1 1 1 1 1 1 1
symmnumber: 1
zpe: 326172.2 jmol-1
zpe.correction: 0.124232 hartree
zpe.thermalcorrener: 0.132858 hartree
zpe.thermalcorrenthalpy: 0.133803 hartree
zpe.thermalcorrgfe: 0.090288 hartree
zpe.sumelectzpe: -433.523936 hartree
zpe.sumelectthermal: -433.515310 hartree
zpe.sumelectthermalent: -433.514366 hartree
zpe.sumelectthermalfe: -433.557880 hartree
dipole: 1.3418 -0.8210 0.0020
dipole: 1.5731
quadrupole: -46.7162 -50.4945 -54.6674
quadrupole: 2.7706 0.0057 0.0129
quadrupole: 3.9098 0.1315 -4.0414 2.7706 0.0057 0.0129
hfenergy: -433.6481682 hartree
pointgroup: C01 [X(C5H7N3O1)]
dipole: -0.5479564 0.2876915 0.0007722 debye
dipolederiv: -0.802711 0.2074641 0.0003195 0.1947206 -0.9762344 -0.0014497 -0.0004941 -0.0003679 -0.3861756 0.0819084 0.2013925 -0.0000403 0.2797241 -0.5768085 0.0003307 0.0005208 0.000504 -0.2198118 -0.4965641 -0.2721645 -0.0007014 -0.7376692 -0.5176919 -0.000076 -0.0018204 -0.000113 -0.4672123 -0.166677 -0.1291049 -0.0002611 -0.2499322 -0.4002884 -0.0010428 -0.0004358 -0.000972 -0.0366708 -0.9998407 0.1115693 -0.0002559 0.1553993 0.1911555 -0.0003492 0.0000982 -0.0002042 -0.0365707 0.2932579 0.0293224 0.0000718 -0.0920499 -0.0498978 -0.0000773 0.0000882 -0.0002027 -0.2240603 -0.23674 -0.2024096 0.0000278 0.0925919 0.2330799 -0.0002269 -0.0000805 -0.0002072 -0.1719823 -0.1862178 -0.0295574 0.0000333 -0.2860741 -0.0826966 -0.000019 0.0000695 -0.0000053 -0.2481462 1.8134465 0.0303185 0.0007857 0.2580909 1.2896239 0.0026158 0.0015005 0.00179 0.2553053 0.263394 0.0428205 0.0000504 -0.0084302 0.2742782 -0.0000037 -0.0000659 -0.0002475 0.331595 0.0828706 -0.0909572 -0.0000353 -0.0723538 -0.0285951 0.0000532 -0.0000359 0.0000878 0.1960285 0.0341103 -0.0588458 -0.0000139 -0.0743359 0.0310948 0.0000634 -0.0000997 0.0000601 0.2214551 -0.0324644 0.0791444 -0.0000551 0.0822862 0.0654393 0.0000436 -0.000032 0.0000181 0.203366 0.0709624 0.0567349 -0.0000295 0.1087056 0.1509623 -0.0004349 -0.000116 -0.0005707 0.3555367 0.1405925 0.0122916 -0.0335733 0.1747822 0.1988394 -0.1484951 -0.0400173 -0.0891303 0.1130869 0.1406725 0.011981 0.0336773 0.1745444 0.1977395 0.1490679 0.0409205 0.0895609 0.1142563 unknown
polarizability: 118.123158|0.2383259|78.3256705|0.024738|0.0170949|36.9274726 unknown
InChI: InChI=1S/C5H7N3O/c6-8-5(9)4-2-1-3-7-4/h1-3,7-8H,6H2
charge 0 multiplicity 1
16 atoms
O  1.549332 -1.316203 -0.000658
N  -1.21778 -0.965492 0.000758
N  1.922377 0.986739 0.00333
N  3.336701 0.876236 0.003902
C  -0.365161 0.140149 0.000626
C  -1.177237 1.295257 0.000551
C  -2.5365 -0.548885 0.00062
C  -2.541871 0.859928 0.000113
C  1.085275 -0.124411 0.000081
H  -0.849171 -1.918796 0.000075
H  -0.835989 2.330579 0.000266
H  -3.363567 -1.255622 0.000734
H  -3.42794 1.492379 -0.000241
H  1.553873 1.937885 0.005705
H  3.657022 0.38397 -0.842117
H  3.655936 0.380087 0.848054
