program: Gaussian 09
title: 000281620
version: EM64L-G09RevD.01
frameworkgroup: C1[X(C11H17NO5)]
method: RPBEPBE
basis: SDD
operation: Freq
keyword: #p
keyword: freq=noraman
keyword: PBEPBE/SDD
title: #p freq=noraman PBEPBE/SDD
converged: YES YES NO NO
title: Mulliken charges:
elementType: O O O O O N C C C C C C C C C C C H H H H H H H H H H H H H H H H H
charge: -0.191608 -0.303216 -0.290135 -0.307454 -0.239055 -0.185475 -0.412648 -0.409145 0.111688 0.120272 0.293161 0.151879 -0.505959 -0.248677 -0.255618 -0.665752 -0.667335 0.255239 0.256437 0.250415 0.251804 0.257413 0.224614 0.230274 0.233817 0.218385 0.232570 0.217825 0.249114 0.214123 0.224385 0.213717 0.251469 0.223477
chargesum: 0.00000
title: Mulliken charges with hydrogens summed into heavy atoms:
elementType: O O O O O N C C C C C C C C C C C
charge: -0.191608 -0.303216 -0.290135 -0.307454 -0.239055 -0.185475 0.099028 0.093073 0.111688 0.120272 0.293161 0.151879 0.206342 0.203525 0.194777 0.021870 0.021327
polarizability: 1.76710304e+02 8.58979362e+00 1.79833687e+02 -2.83136807e+00 -1.65858163e+00 9.36425699e+01
1716.lowfreq: -0.0006 -0.0004 0.0004 2.8587 5.5042 10.1999 31.8620 38.1910 44.4226
frequency: 31.8081 38.1780 44.3461 53.4017 62.7856 80.1606 88.7027 101.4053 102.7321 126.8886 159.1894 178.5685 191.0926 214.0981 221.4861 234.6855 267.0453 286.0047 306.8520 316.8902 341.1968 380.1520 424.2029 439.9237 507.6770 525.6110 590.5853 620.5716 694.2390 697.5665 721.3819 738.8537 795.1368 811.8089 815.3730 824.0405 867.1923 926.0185 974.7042 984.3652 1004.1901 1016.7824 1028.2405 1065.2773 1094.9865 1096.2608 1103.4061 1137.6240 1148.6027 1154.0089 1154.9789 1156.0579 1174.7592 1185.9738 1226.2447 1280.7635 1282.5337 1287.8443 1310.4391 1348.8096 1352.9154 1365.8724 1388.4116 1388.8471 1392.9761 1441.2854 1456.0842 1458.4171 1460.5606 1462.9054 1463.2981 1470.8198 1481.3797 1484.5602 1484.9320 1491.5916 1625.3752 1634.3605 1663.1740 2952.3535 2981.0092 2989.6165 2990.3412 2990.4008 2997.6822 3025.2281 3027.1627 3043.6094 3077.9700 3084.7981 3085.4093 3089.2157 3089.6843 3115.1189 3115.8432 3142.0281
redmass: 3.5878 3.2506 2.6307 3.5648 2.7292 5.1444 3.3297 4.3923 4.2853 3.1545 1.4493 2.8567 2.3993 1.2285 2.6468 1.5481 4.6359 4.2134 2.5313 3.0804 4.6009 6.3676 3.6224 3.7237 5.2175 3.8909 4.0097 5.1899 4.7442 9.5036 7.5494 3.2390 2.1345 1.4303 1.7339 3.3687 3.4153 5.9196 4.0499 1.6735 2.7172 1.7004 4.2399 5.5123 2.1582 2.1464 1.2477 1.7008 3.6425 1.6831 1.5079 1.1948 1.0685 3.6681 3.5455 1.1606 1.1778 2.0312 2.3211 1.5424 1.4771 1.9578 1.2610 1.3582 2.3914 1.2160 1.0936 1.1073 1.0631 1.0441 1.0503 1.0528 1.0757 1.0540 1.0518 1.0848 10.5289 9.8182 9.1599 1.0574 1.0334 1.1008 1.0361 1.0361 1.0586 1.0590 1.0594 1.1055 1.1050 1.0979 1.0974 1.1032 1.1033 1.1052 1.1057 1.1010
irintensity: 0.4282 2.3777 3.7648 0.0801 0.6738 3.4324 3.1780 0.1213 5.2977 3.8268 3.2686 0.7546 1.3841 6.4251 8.4470 0.4081 2.7197 3.7478 20.8794 8.6720 1.8551 0.6778 3.0259 3.9101 5.6955 0.7598 9.0489 13.6609 11.7804 19.0031 14.4396 3.3230 19.6699 2.8049 0.6360 1.8825 24.3269 0.7935 166.9460 1.0371 13.7774 1.4007 280.0195 313.7667 28.1378 15.3512 0.5662 12.1847 41.3251 42.3193 35.0817 6.9771 0.3735 2.0693 283.2678 7.0765 18.1389 44.3197 170.7130 60.8652 3.5478 17.6022 64.3324 65.5869 139.0627 1.1817 26.8767 46.5060 28.0890 14.6930 18.0575 18.1770 12.9942 16.4073 14.1597 14.2397 357.5219 482.4015 172.1872 37.0417 62.9330 16.5689 33.1239 12.7213 17.9526 38.6057 34.6432 18.2627 35.5964 40.5205 39.1396 4.2371 1.7719 30.4819 35.8875 14.6507
temp: 298.150 k
press: 1.00000 atm
elementType: 8 8 8 8 8 7 6 6 6 6 6 6 6 6 6 6 6 1 1 1 1 1 1 1 1 1 1 1 1 1 1 1 1 1
symmnumber: 1
zpe: 716622.6 jmol-1
zpe.correction: 0.272947 hartree
zpe.thermalcorrener: 0.292203 hartree
zpe.thermalcorrenthalpy: 0.293148 hartree
zpe.thermalcorrgfe: 0.223172 hartree
zpe.sumelectzpe: -858.897704 hartree
zpe.sumelectthermal: -858.878447 hartree
zpe.sumelectthermalent: -858.877503 hartree
zpe.sumelectthermalfe: -858.947478 hartree
dipole: 0.8802 0.0609 0.0809
dipole: 0.8860
quadrupole: -109.6607 -78.9885 -99.1189
quadrupole: -1.0271 2.5945 0.2735
quadrupole: -13.7380 16.9342 -3.1962 -1.0271 2.5945 0.2735
hfenergy: -859.1706508 hartree
pointgroup: C01 [X(C11H17N1O5)]
dipole: 0.3377888 -0.0691836 -0.0511053 debye
polarizability: 174.5657839|-7.9964648|182.0030429|-2.0312102|-1.7295108|93.6177342 unknown
InChI: InChI=1S/C11H17NO5/c1-4-16-10(13)8-6-12(7-9(8)15-3)11(14)17-5-2/h4-7H2,1-3H3
charge 0 multiplicity 1
34 atoms
O  -1.907097 -2.234294 0.186374
O  2.989598 1.087302 0.261769
O  -2.09283 2.163579 -0.071408
O  3.38568 -1.243252 0.38013
O  -3.505321 0.286464 -0.044658
N  1.227687 -0.363649 0.22458
C  0.269272 0.770629 0.134308
C  0.579839 -1.683163 0.271839
C  -1.072327 0.055249 0.098038
C  -0.892998 -1.306453 0.174514
C  2.593619 -0.262367 0.292573
C  -2.34553 0.769449 -0.006148
C  -1.540407 -3.664126 0.139711
C  4.462601 1.317278 0.285488
C  -3.29626 3.039138 -0.157542
C  5.051742 1.25298 -1.126398
C  -3.843589 3.352515 1.238921
H  0.36763 1.448086 1.00231
H  0.450677 1.377793 -0.771258
H  0.915195 -2.332761 -0.562736
H  0.821815 -2.22016 1.212717
H  -2.493882 -4.199218 0.247885
H  -0.863199 -3.934308 0.970426
H  -1.07527 -3.91843 -0.830089
H  4.926066 0.563351 0.9459
H  4.559548 2.321737 0.72875
H  -4.057355 2.533517 -0.777903
H  -2.927464 3.943273 -0.66896
H  4.956338 0.235353 -1.541159
H  6.126249 1.514026 -1.095943
H  4.542308 1.96514 -1.798669
H  -4.682646 4.069133 1.161361
H  -4.217164 2.435337 1.724172
H  -3.062321 3.802552 1.875906
