program: Gaussian 09
title: 000281677
version: EM64L-G09RevD.01
frameworkgroup: C1[X(C18H22O6)]
method: RPBEPBE
basis: SDD
operation: Freq
keyword: #pfreq=noraman
keyword: PBEPBE/SDD
title: #p freq=noraman PBEPBE/SDD
converged: YES YES NO NO
title: Mulliken charges:
elementType: O O O O O O C C C C C C C C C C C C C C C C C C H H H H H H H H H H H H H H H H H H H H H H
charge: -0.293475 -0.308871 -0.296614 -0.434015 -0.265776 -0.440469 -0.022116 0.214671 0.253852 0.111261 0.217277 0.038762 -0.567884 0.273925 -0.388775 -0.453211 -0.534180 -0.452823 0.335421 -0.388301 -0.522079 -0.525264 -0.527269 -0.537061 0.299772 0.242794 0.233386 0.241144 0.293684 0.235029 0.244984 0.240969 0.259713 0.227373 0.217232 0.336434 0.341060 0.250774 0.226860 0.233411 0.254883 0.218587 0.230158 0.245792 0.218375 0.220600
chargesum: 0.00000
title: Mulliken charges with hydrogens summed into heavy atoms:
elementType: O O O O O O C C C C C C C C C C C C C C C C C C
charge: -0.293475 -0.308871 -0.296614 -0.097581 -0.265776 -0.099410 -0.022116 0.214671 0.253852 0.111261 0.217277 0.038762 -0.268112 0.273925 -0.145981 0.021319 -0.240496 0.027190 0.335421 -0.147333 0.182239 0.185780 0.176358 0.147707
polarizability: 3.08906672e+02 -9.45967691e-01 2.01827899e+02 -7.98072532e+00 -3.55436924e+00 1.66136068e+02
1716.lowfreq: -8.6307 -2.5607 0.0005 0.0006 0.0008 4.4917 24.5661 29.2490 34.7116
frequency: 24.3890 29.0588 34.6339 45.2705 50.4557 58.6615 71.3180 80.9093 89.1562 90.2739 111.5863 138.2708 142.2141 147.5940 159.5157 163.4029 164.8198 180.0038 193.5249 209.7792 236.4305 241.5188 253.3849 255.7727 273.0924 308.5122 332.4317 346.6966 351.5874 362.9868 375.5511 393.2892 412.0639 438.2038 452.4316 494.8928 511.5143 538.9477 562.6079 572.6764 589.6828 609.2450 637.5527 678.9883 687.7883 721.6640 740.9791 789.6148 797.8897 813.7669 868.6901 884.3926 896.6519 900.3299 902.4964 937.4836 948.3727 954.7430 959.9531 982.7261 990.3820 1009.1881 1023.4897 1042.3031 1089.4536 1107.6454 1110.4455 1110.8909 1113.9711 1121.0683 1141.3340 1150.9788 1154.1309 1157.9312 1161.6665 1172.0504 1176.0408 1186.1421 1212.9566 1247.0144 1264.0634 1302.2559 1309.9265 1326.9931 1340.5294 1352.6668 1362.2386 1371.6855 1381.9620 1415.8318 1424.4901 1429.9226 1435.6184 1438.6616 1448.9152 1455.7567 1457.8165 1459.9115 1462.1189 1466.5939 1468.5118 1473.2288 1474.4144 1482.1647 1484.9761 1493.0605 1552.5173 1570.5027 1596.5996 1621.6642 2957.1120 2971.2328 2974.1576 2976.1872 2993.9218 2994.5259 3043.8386 3051.1963 3053.5232 3070.4038 3075.8485 3079.0137 3119.8825 3121.1638 3121.6825 3122.9751 3124.5687 3160.3334 3163.7816 3165.8273 3554.1688 3556.4380
redmass: 5.1930 4.1717 3.8367 3.6854 3.1567 3.4845 2.9347 2.8116 3.3210 3.1742 3.6033 3.3439 2.7390 2.2825 1.8228 1.1854 1.2206 2.3887 2.5995 2.8812 5.1694 1.3839 2.9846 4.9269 3.6856 7.3146 1.9486 2.7031 2.1067 2.3360 2.7487 5.5383 4.8596 4.5878 3.2170 5.1978 5.1273 5.7359 4.9795 4.2880 4.5169 4.4951 5.5613 5.1065 4.9974 5.6868 4.1283 3.8953 5.8071 1.6927 6.5584 3.8410 1.4364 1.9142 3.4600 1.4117 6.9657 2.8925 2.2201 2.7079 3.2890 3.9826 4.8919 6.3535 4.0517 1.2469 1.2461 1.2612 1.2430 2.0912 1.5146 1.3570 1.4162 1.4079 1.1530 1.1712 1.4883 1.7865 2.0058 3.5360 1.7639 2.3387 2.8942 1.3862 2.5065 1.8383 1.8236 2.0654 2.4199 1.3618 2.3091 1.2965 1.4027 1.3247 2.0880 1.1192 1.0604 1.0851 1.1078 1.0509 1.0935 1.0761 1.0546 1.0578 1.0577 3.2007 8.7891 7.6270 7.6987 6.8575 1.0331 1.0316 1.0318 1.0297 1.0595 1.0590 1.1038 1.1028 1.1028 1.1028 1.1054 1.1015 1.1030 1.0895 1.1030 1.1037 1.0987 1.0939 1.0913 1.0912 1.0660 1.0659
irintensity: 0.6180 0.4329 0.3997 1.6280 3.1203 2.4761 5.8173 2.5000 5.1136 7.4414 1.8995 4.6583 5.5324 1.0062 0.1761 1.1095 0.4506 0.6939 1.4806 3.8915 11.3754 0.5465 2.6762 13.7300 36.5305 1.8266 63.7162 11.0430 139.0857 16.6337 84.6628 2.7908 9.0383 13.8360 6.1193 5.4045 3.6787 7.6694 21.8425 14.5463 2.1049 2.9766 10.6474 1.3975 9.9734 4.8018 2.4294 26.5993 0.2358 25.7198 17.7378 29.9690 11.3620 26.2753 34.1410 5.7582 104.3126 89.9009 89.6986 24.5664 13.9330 39.0382 99.2526 82.8862 40.4760 5.4247 11.2723 0.1800 1.8813 34.1083 19.6212 4.0114 10.0680 10.5056 7.5778 23.8227 25.0221 20.9450 81.7216 75.9945 90.9338 69.9911 66.8840 29.9327 35.0580 33.3669 9.1599 5.5878 65.5102 27.5118 28.0413 27.3045 10.8510 8.9560 120.6520 24.9963 12.6031 11.8899 4.6504 13.5803 0.4776 30.5107 7.1267 12.8975 26.9250 20.7056 40.0348 20.7059 36.2220 77.0279 74.0093 81.8908 83.1696 47.2371 17.9295 51.3624 48.6416 11.7399 12.8254 26.1260 24.0059 26.3703 25.8707 21.7158 25.2957 17.5650 17.3825 11.7530 5.4027 1.9899 8.4642 9.4075
temp: 298.150 k
press: 1.00000 atm
elementType: 8 8 8 8 8 8 6 6 6 6 6 6 6 6 6 6 6 6 6 6 6 6 6 6 1 1 1 1 1 1 1 1 1 1 1 1 1 1 1 1 1 1 1 1 1 1
symmnumber: 1
zpe: 958561.1 jmol-1
zpe.correction: 0.365097 hartree
zpe.thermalcorrener: 0.391458 hartree
zpe.thermalcorrenthalpy: 0.392402 hartree
zpe.thermalcorrgfe: 0.307030 hartree
zpe.sumelectzpe: -1148.559429 hartree
zpe.sumelectthermal: -1148.533068 hartree
zpe.sumelectthermalent: -1148.532123 hartree
zpe.sumelectthermalfe: -1148.617496 hartree
dipole: -0.7958 -1.1833 -5.7093
dipole: 5.8847
quadrupole: -122.7105 -141.8544 -141.9976
quadrupole: 10.9091 -9.0345 -6.2195
quadrupole: 12.8103 -6.3336 -6.4768 10.9091 -9.0345 -6.2195
hfenergy: -1148.9245259 hartree
pointgroup: C01 [X(C18H22O6)]
dipole: -0.2984378 0.5671898 2.2247262 debye
polarizability: 308.4831168|8.946373|202.0683543|4.698425|-5.1827759|166.3191679 unknown
InChI: InChI=1S/C18H22O6/c1-21-13-5-6-14(11(7-13)9-19)16-12(10-20)8-15(22-2)17(23-3)18(16)24-4/h5-8,19-20H,9-10H2,1-4H3
charge 0 multiplicity 1
46 atoms
O  -0.727593 1.861365 0.446746
O  -3.530096 1.397032 0.566568
O  -4.515245 -1.262125 -0.028434
O  -0.477309 -4.247909 -0.48891
O  5.333718 0.552239 0.129027
O  1.784163 2.044476 -3.001478
C  -0.320675 -0.483165 -0.023411
C  1.156584 -0.201099 0.019117
C  -0.836892 -1.773765 -0.346743
C  -1.243522 0.560407 0.274626
C  1.827185 0.502588 -1.02819
C  -2.644282 0.325228 0.290983
C  -2.230954 -2.012242 -0.309568
C  -3.131806 -0.981988 0.02256
C  1.917557 -0.648178 1.124519
C  0.090469 -2.916973 -0.757081
C  3.215915 0.723624 -0.946559
C  1.055085 1.022463 -2.239115
C  3.9591 0.267024 0.168531
C  3.309812 -0.423112 1.219658
C  -0.989667 2.501464 1.755178
C  -4.22623 1.899491 -0.644469
C  -5.259807 -1.035078 1.231773
C  6.151802 0.08647 1.250231
H  -2.622923 -3.002353 -0.55908
H  1.405993 -1.175458 1.93889
H  1.083303 -2.807112 -0.280901
H  0.244526 -2.914842 -1.851186
H  3.735506 1.24143 -1.758161
H  0.883355 0.213188 -2.971373
H  0.069734 1.40904 -1.91601
H  3.857668 -0.778982 2.097129
H  -2.074755 2.574962 1.939585
H  -0.539959 3.503451 1.681877
H  -0.495532 1.927404 2.562174
H  -0.665157 -4.322174 0.481381
H  1.931725 2.8277 -2.412331
H  -4.809289 1.087649 -1.115936
H  -4.896262 2.698692 -0.292067
H  -3.490643 2.309191 -1.360788
H  -5.150226 0.009073 1.573472
H  -4.899441 -1.730102 2.014225
H  -6.310712 -1.256769 0.991363
H  7.177159 0.402982 1.008971
H  5.832914 0.551561 2.203745
H  6.114906 -1.016466 1.345961
