program: Gaussian 09
title: 000281678
version: EM64L-G09RevD.01
frameworkgroup: C1[X(C19H19NO5)]
method: RPBEPBE
basis: SDD
operation: Freq
keyword: #p
keyword: freq=noraman
keyword: PBEPBE/SDD
title: #p freq=noraman PBEPBE/SDD
converged: YES YES NO NO
title: Mulliken charges:
elementType: O O O O O N C C C C C C C C C C C C C C C C C C C H H H H H H H H H H H H H H H H H H H
charge: -0.265529 -0.270941 -0.305580 -0.280913 -0.302068 -0.447903 0.193720 0.152804 0.257597 0.058746 -0.370254 0.591623 -0.521753 -0.335861 0.298636 -0.342673 -0.541449 -0.650796 0.266403 0.235872 0.016662 -0.537758 -0.527318 -0.524961 -0.524583 0.214379 0.321579 0.241129 0.237027 0.251928 0.349822 0.248739 0.245993 0.218489 0.219420 0.222759 0.230495 0.251881 0.255365 0.216587 0.231214 0.228449 0.256213 0.236806
chargesum: 0.00000
title: Mulliken charges with hydrogens summed into heavy atoms:
elementType: O O O O O N C C C C C C C C C C C C C C C C C C C
charge: -0.265529 -0.270941 -0.305580 -0.280913 -0.302068 -0.126324 0.193720 0.152804 0.257597 0.058746 -0.155875 0.591623 -0.280624 -0.098834 0.298636 -0.090745 -0.191627 -0.402056 0.266403 0.235872 0.016662 0.146144 0.177818 0.178205 0.196885
polarizability: 4.79290251e+02 -1.36515253e+01 2.66925533e+02 -2.60314724e+00 1.07189334e-01 1.16574050e+02
1716.lowfreq: -7.2080 -3.6325 -0.9482 -0.0008 -0.0006 -0.0005 21.4642 30.9277 56.3084
frequency: 21.4182 30.8602 56.3056 59.7133 72.5689 81.7062 85.1468 97.1274 111.6651 118.3884 128.7240 153.7272 157.3678 170.9285 171.9258 189.4357 204.9909 211.4279 224.0004 242.5286 250.8098 276.4660 311.0883 324.5847 328.8628 366.4380 380.8301 392.4863 407.2080 430.6845 444.2146 451.0946 483.7623 510.9140 542.3202 564.3243 575.9005 599.0872 602.5282 609.8565 637.1767 655.0230 686.3731 719.9589 737.2103 766.3528 770.7076 777.4654 783.7701 814.9084 854.2704 867.7454 873.5940 877.3862 916.3551 936.5212 938.7789 946.2281 972.6302 975.2134 999.8063 1019.6215 1039.9932 1105.4584 1110.0111 1112.5536 1113.0458 1113.8279 1122.5708 1149.0169 1151.3203 1155.3628 1158.7892 1164.2070 1179.3687 1198.8237 1225.5144 1233.8456 1246.8317 1288.9412 1299.4163 1334.9724 1354.7185 1383.6169 1410.1050 1414.0543 1418.1945 1431.4909 1433.7904 1442.9206 1453.4986 1458.2652 1458.6539 1460.7035 1464.5042 1465.7828 1471.8920 1476.3594 1482.5294 1485.1733 1485.4317 1546.8530 1584.2908 1608.0127 1614.9724 1627.8184 1644.1184 2952.1947 2972.7074 2973.8110 2982.1756 3037.6267 3067.1609 3071.3023 3076.9329 3084.3281 3122.0067 3122.1153 3124.6711 3125.7357 3132.6473 3145.7922 3146.2057 3152.0991 3174.1101 3597.2721
redmass: 4.7608 4.5041 4.1299 4.1286 3.5110 3.7114 3.0411 2.7398 5.2361 4.4230 2.8424 1.2293 1.3038 1.1026 3.4110 3.1879 3.3832 4.1295 4.8751 2.5629 2.0679 4.7026 4.3681 4.3306 5.8844 5.3801 6.0243 4.1754 7.3294 3.4451 4.7160 5.0060 4.9725 5.6258 5.3911 6.4426 1.2252 4.9321 4.1006 4.7311 4.7508 3.9000 6.8776 5.7128 4.4919 5.4391 4.9549 3.9589 6.1099 1.4694 1.7140 3.7743 3.9799 2.3564 6.9475 1.3640 8.9858 1.4951 5.1141 1.5511 3.3477 4.3290 4.9831 1.8401 1.2401 1.2921 1.2599 1.2452 2.5618 1.6153 1.3624 1.4220 1.5005 2.3236 2.5479 2.2379 2.1696 1.6298 1.9009 2.0955 3.0107 3.6201 3.8478 3.3249 2.2089 1.8848 1.3028 1.4225 1.2723 1.6781 1.9858 1.0719 1.4906 1.0923 1.7052 1.0504 1.2791 1.0581 1.0568 1.3685 1.5055 6.5446 6.7568 6.9742 7.5834 7.4198 7.3829 1.0334 1.0326 1.0315 1.0293 1.1038 1.0858 1.1033 1.1006 1.1056 1.1027 1.0988 1.1034 1.1036 1.0950 1.0894 1.0917 1.0907 1.0959 1.0798
irintensity: 0.0757 1.3360 3.5188 1.7516 2.5727 1.7549 2.6739 8.1565 10.7622 1.0244 2.6910 0.2915 1.9998 0.1612 2.3190 0.3185 4.0370 2.5941 5.6351 7.3794 7.5789 10.7926 3.9295 5.9049 1.9751 5.3879 0.1735 8.6057 5.1966 0.9508 2.1206 2.4083 2.4282 6.3225 0.5759 11.9718 123.4698 9.3051 28.2946 34.1802 17.7407 15.5508 0.7544 6.9693 5.5756 8.4543 3.2209 5.2821 42.0289 55.1146 24.4074 6.7362 5.8009 13.8534 37.0626 0.5334 99.4086 7.9771 8.5409 44.9678 45.7953 115.4985 148.0554 2.7998 13.0376 41.8051 0.1773 2.2842 42.1791 68.0885 1.4962 19.1680 17.9059 143.7793 247.0889 56.5467 83.5638 8.4642 25.2736 19.2654 386.6128 1.0697 79.1045 31.5141 8.0548 32.8982 20.1246 83.2409 36.5269 50.6279 116.8983 16.0301 3.7084 1.6009 36.1997 13.6354 178.4501 5.1682 10.0154 48.3924 135.4919 133.8789 61.9112 32.3550 29.5276 26.8909 256.9938 50.7138 56.3888 118.6991 82.0680 52.2369 16.1845 26.8392 31.6331 19.0323 23.9227 35.1365 16.9687 29.1913 58.4447 14.5151 3.9671 5.2230 8.5605 55.9077
temp: 298.150 k
press: 1.00000 atm
elementType: 8 8 8 8 8 7 6 6 6 6 6 6 6 6 6 6 6 6 6 6 6 6 6 6 6 1 1 1 1 1 1 1 1 1 1 1 1 1 1 1 1 1 1 1
symmnumber: 1
zpe: 894884.7 jmol-1
zpe.correction: 0.340844 hartree
zpe.thermalcorrener: 0.365234 hartree
zpe.thermalcorrenthalpy: 0.366179 hartree
zpe.thermalcorrgfe: 0.286004 hartree
zpe.sumelectzpe: -1164.426389 hartree
zpe.sumelectthermal: -1164.401998 hartree
zpe.sumelectthermalent: -1164.401054 hartree
zpe.sumelectthermalfe: -1164.481229 hartree
dipole: -1.1960 3.4446 -1.1729
dipole: 3.8303
quadrupole: -120.7732 -133.7158 -146.3971
quadrupole: -8.7732 3.0340 0.3591
quadrupole: 12.8555 -0.0871 -12.7684 -8.7732 3.0340 0.3591
hfenergy: -1164.7672323 hartree
pointgroup: C01 [X(C19H19N1O5)]
dipole: -0.4859964 1.3699228 -0.3975703 debye
polarizability: 479.1007721|-12.3849399|266.562708|-11.132545|6.2348845|117.1263537 unknown
InChI: InChI=1S/C19H19NO5/c1-22-12-5-6-15-13(10-12)14(19(21)20-15)7-11-8-16(23-2)18(25-4)17(9-11)24-3/h5-10,20H,1-4H3
charge 0 multiplicity 1
44 atoms
O  5.861525 2.004248 -0.039442
O  0.57001 -3.138801 -0.173891
O  -3.635051 2.569953 0.185989
O  -3.745409 -2.379213 0.14925
O  -5.165851 0.112185 0.254927
N  2.89184 -2.742752 -0.212623
C  3.017146 -0.449047 -0.09682
C  1.585895 -0.819222 -0.080076
C  3.784158 -1.646253 -0.177401
C  1.547095 -2.331469 -0.155976
C  0.556543 0.101884 -0.015918
C  -0.90241 0.016717 0.016129
C  3.66874 0.803738 -0.047748
C  5.189815 -1.626977 -0.210398
C  5.085612 0.829089 -0.081327
C  5.837135 -0.37382 -0.161774
C  -1.662889 -1.190152 0.000713
C  -1.602772 1.263415 0.052432
C  -3.003788 1.305575 0.098414
C  -3.070115 -1.149603 0.058717
C  -3.759579 0.097118 0.140689
C  5.148374 3.277903 0.04576
C  -4.530724 2.896141 -0.948533
C  -4.798422 -2.637382 -0.857038
C  -5.661361 0.629687 1.557309
H  0.907875 1.146103 0.017033
H  3.151991 -3.726304 -0.267568
H  3.09007 1.730167 0.016046
H  5.777268 -2.548749 -0.271857
H  6.928341 -0.300134 -0.184248
H  -1.158172 -2.16066 -0.039312
H  -1.059884 2.214983 0.042483
H  5.933692 4.047781 0.067219
H  4.496797 3.436922 -0.836456
H  4.541252 3.341108 0.970664
H  -3.948245 2.952054 -1.887735
H  -4.953914 3.883932 -0.71074
H  -5.334148 2.144514 -1.047793
H  -5.589968 -1.870928 -0.807074
H  -4.353984 -2.667426 -1.870693
H  -5.20122 -3.628551 -0.599342
H  -6.758932 0.616449 1.478377
H  -5.294581 1.657293 1.728485
H  -5.329956 -0.038217 2.372747
