program: Gaussian 09
title: 000281612
version: EM64L-G09RevD.01
frameworkgroup: C1[X(C13H11NO4)]
method: RPBEPBE
basis: SDD
operation: Freq
keyword: #p
keyword: freq=noraman
keyword: PBEPBE/SDD
title: #p freq=noraman PBEPBE/SDD
converged: YES YES NO NO
title: Mulliken charges:
elementType: O O O O N C C C C C C C C C C C C C H H H H H H H H H H H
charge: -0.196393 -0.196348 -0.275042 -0.249316 -0.221706 0.175210 0.185585 0.115209 0.089092 -0.439285 -0.350037 -0.350507 -0.063711 -0.209055 -0.209988 -0.315347 0.235829 -0.505154 0.254731 0.244314 0.270451 0.270718 0.281047 0.240154 0.240270 0.260488 0.241904 0.242895 0.233991
chargesum: 0.00000
title: Mulliken charges with hydrogens summed into heavy atoms:
elementType: O O O O N C C C C C C C C C C C C C
charge: -0.196393 -0.196348 -0.275042 -0.249316 -0.221706 0.175210 0.185585 0.115209 0.089092 0.059761 -0.079586 -0.079790 0.217336 0.031099 0.030282 -0.054859 0.235829 0.213636
polarizability: 2.29816739e+02 -7.45933601e+00 1.56706330e+02 2.55088043e+01 -1.05379333e+01 1.05944677e+02
1716.lowfreq: -5.8613 -0.0006 -0.0004 0.0005 0.4370 6.4297 18.7153 21.9217 38.5124
frequency: 18.4318 21.9048 38.5099 86.6802 99.0806 104.2324 124.9460 138.0173 166.5970 204.1696 220.1531 236.7812 247.7579 276.2929 294.8717 336.7258 387.2262 412.3807 455.1322 455.8480 523.0321 531.6456 590.9993 659.0313 670.1925 671.4385 681.4884 702.2180 720.5174 785.6659 796.4527 814.5807 859.7406 864.1117 907.1013 934.0869 950.9188 975.0698 985.4521 998.6685 1006.8526 1016.4868 1045.0518 1072.7611 1107.6934 1113.0389 1149.8749 1154.6360 1168.4731 1171.5777 1202.9276 1266.0832 1283.9913 1289.9637 1316.8042 1332.1176 1367.6088 1416.3644 1423.6327 1437.3495 1452.3045 1453.9077 1455.1666 1463.0640 1614.4433 1618.8079 1625.3525 1631.1439 1671.4140 1678.5288 3003.0492 3003.5256 3078.1682 3103.2148 3119.8116 3140.6191 3149.0616 3154.0433 3155.8727 3165.6119 3175.4456
redmass: 6.5933 5.5903 6.4814 2.9431 4.8754 1.1938 5.1722 4.9927 6.7851 2.7373 4.5736 5.1143 5.5091 5.7246 3.1944 8.2208 3.7415 3.2823 4.8748 4.8577 7.1620 4.8125 8.2993 4.8009 4.8889 4.9544 6.5984 4.8465 3.3295 5.2558 1.6949 2.9633 6.1333 2.8930 1.3945 3.1256 5.2684 1.4135 4.1022 1.2230 1.3492 2.0274 3.0810 2.6954 2.3602 1.2694 1.4546 3.5826 1.2286 1.9931 2.8679 1.5194 1.4610 1.4279 1.8049 2.3057 1.5849 5.9003 1.1894 1.1266 1.0495 2.4677 2.6965 1.0513 7.6645 7.9237 9.8325 11.7540 6.5712 11.5407 1.0299 1.0608 1.1007 1.1043 1.0926 1.0865 1.1045 1.0907 1.0923 1.0957 1.1004
irintensity: 0.4052 1.1892 1.5729 1.7886 3.6266 0.1152 2.3343 0.0042 1.7711 2.0940 3.7386 5.0129 5.3807 9.1728 12.1036 10.7972 15.6917 0.8637 10.6903 0.1321 8.4878 0.8747 6.9321 0.0464 14.1274 7.5313 6.8730 15.0658 76.4555 0.1597 29.0422 1.5477 4.2078 6.6907 0.0170 44.3559 15.1038 2.1739 67.8538 37.1636 0.0109 2.9588 57.3736 13.2634 107.9285 0.2192 3.2947 242.5638 4.2665 3.8018 15.1820 76.7158 1.8668 57.9842 79.7596 315.3923 34.2981 7.6425 21.9241 52.4676 14.4428 12.1229 2.0326 11.7865 2.2083 77.1763 135.4798 384.6920 57.1165 57.5285 36.5608 14.5094 3.4261 26.8530 0.9322 1.6860 18.3429 4.9380 4.6513 5.3240 20.7085
temp: 298.150 k
press: 1.00000 atm
elementType: 8 8 8 8 7 6 6 6 6 6 6 6 6 6 6 6 6 6 1 1 1 1 1 1 1 1 1 1 1
symmnumber: 1
zpe: 563465.0 jmol-1
zpe.correction: 0.214612 hartree
zpe.thermalcorrener: 0.231074 hartree
zpe.thermalcorrenthalpy: 0.232018 hartree
zpe.thermalcorrgfe: 0.167769 hartree
zpe.sumelectzpe: -856.363807 hartree
zpe.sumelectthermal: -856.347346 hartree
zpe.sumelectthermalent: -856.346402 hartree
zpe.sumelectthermalfe: -856.410651 hartree
dipole: -2.3543 -1.6316 0.0638
dipole: 2.8652
quadrupole: -70.5578 -110.6618 -104.9851
quadrupole: 1.3116 7.9980 6.6579
quadrupole: 24.8438 -15.2603 -9.5835 1.3116 7.9980 6.6579
hfenergy: -856.5784199 hartree
pointgroup: C01 [X(C13H11N1O4)]
dipole: 0.9442543 0.5267343 -0.3187779 debye
polarizability: 229.8173179|-21.5199667|151.0990441|-14.2769159|-20.0891635|111.5513839 unknown
InChI: InChI=1S/C13H11NO4/c1-18-11(15)7-4-8-14-12(16)9-5-2-3-6-10(9)13(14)17/h2-7H,8H2,1H3
charge 0 multiplicity 1
29 atoms
O  0.38364 2.074856 0.132864
O  1.224928 -2.299693 1.661613
O  -5.146771 0.59584 -0.443444
O  -4.122713 -1.433327 -0.987082
N  0.492332 -0.123514 1.040192
C  2.326864 0.551286 -0.224623
C  2.582504 -0.763346 0.238359
C  0.985763 0.984778 0.286025
C  1.412635 -1.214926 1.057848
C  -0.816516 -0.143019 1.715866
C  3.254715 1.239735 -1.019832
C  3.773148 -1.433279 -0.079262
C  -1.929424 -0.578647 0.78524
C  4.46252 0.569944 -1.348351
C  4.717751 -0.74585 -0.885553
C  -3.042352 0.160021 0.536471
C  -4.107665 -0.342175 -0.365365
C  -6.279427 0.217252 -1.319452
H  -0.726663 -0.859528 2.554951
H  -1.011375 0.865421 2.119059
H  3.047524 2.255421 -1.370846
H  3.959562 -2.448483 0.28455
H  -1.822846 -1.560634 0.303027
H  5.210225 1.075173 -1.968946
H  5.658586 -1.236947 -1.155799
H  -3.197485 1.149954 0.978431
H  -6.745766 -0.715544 -0.959466
H  -5.928658 0.067298 -2.354574
H  -6.979438 1.061837 -1.255803
