program: Gaussian 09
title: 000281632
version: EM64L-G09RevD.01
frameworkgroup: C1[X(C15H19NO4)]
method: RPBEPBE
basis: SDD
operation: Freq
keyword: #p
keyword: freq=noraman
keyword: PBEPBE/SDD
title: #p freq=noraman PBEPBE/SDD
converged: YES YES NO NO
title: Mulliken charges:
elementType: O O O O N C C C C C C C C C C C C C C C H H H H H H H H H H H H H H H H H H H
charge: -0.266311 -0.282189 -0.258173 -0.240102 -0.189591 -0.385014 0.103744 -0.552609 0.240639 -0.438477 0.379222 -0.424614 -0.530644 -0.366885 -0.650815 -0.272934 0.269722 0.278588 -0.506135 -0.501451 0.214269 0.221313 0.234590 0.227166 0.255281 0.219543 0.236517 0.304464 0.250160 0.250069 0.262057 0.258043 0.224580 0.233379 0.242400 0.242477 0.244858 0.244551 0.228315
chargesum: 0.00000
title: Mulliken charges with hydrogens summed into heavy atoms:
elementType: O O O O N C C C C C C C C C C C C C C C
charge: -0.266311 -0.282189 -0.258173 -0.240102 -0.189591 0.050567 0.103744 -0.090853 0.240639 0.036346 0.379222 -0.188098 0.023979 -0.116816 -0.130714 -0.048355 0.269722 0.278588 0.212122 0.216273
polarizability: 2.28640183e+02 -6.37097687e+00 1.94447556e+02 -4.31387571e+00 -1.32859710e+01 1.27689868e+02
1716.lowfreq: -8.6350 -0.0004 -0.0002 0.0003 5.7539 8.1268 14.4915 19.7958 25.8102
frequency: 14.0849 19.6896 25.7666 38.9242 58.7807 75.4058 92.6862 98.7330 110.4735 119.2799 135.5202 150.8316 179.9904 210.0513 223.9428 226.8780 258.5410 269.5618 284.6820 307.4649 343.7241 396.7094 420.2859 464.5737 478.2175 505.6949 541.7690 563.3747 587.0841 594.1075 620.6393 637.7393 693.1518 717.6989 752.1687 761.8377 775.4242 796.8862 800.8564 839.4942 852.0056 905.5689 910.1664 951.7722 955.6159 959.3276 973.1651 990.1385 1005.8765 1013.1726 1052.0393 1058.2973 1083.3770 1109.9242 1111.9728 1112.8900 1118.7754 1147.4253 1148.8749 1159.1177 1169.3097 1180.0396 1197.8107 1216.4314 1231.9291 1244.8854 1263.4724 1278.0180 1288.9016 1295.4844 1301.9443 1321.3431 1353.8803 1372.8909 1404.1831 1421.2123 1421.5111 1447.4719 1451.6645 1451.8312 1455.0002 1461.5767 1464.0354 1464.6349 1467.5108 1475.1886 1491.3451 1503.3518 1594.1588 1621.0194 1629.5263 1644.7606 2916.6793 2982.2305 2992.3770 3003.6666 3005.1642 3005.2992 3032.7277 3033.5830 3063.2622 3063.7949 3089.6486 3107.2949 3108.8048 3119.3379 3127.7167 3134.4478 3146.4735 3149.6131 3159.4065
redmass: 4.6967 5.0390 6.0101 5.3859 4.3579 3.3689 1.1146 1.2708 2.7367 3.9022 2.1633 4.1872 4.3545 3.6183 4.4180 3.0656 4.7065 3.5890 3.4651 3.2282 3.6025 2.5957 3.3450 4.1484 3.7852 3.8315 3.4519 5.4145 5.8726 3.7986 4.2223 4.7933 3.5822 5.4651 2.8309 1.6846 3.6749 1.5539 2.5044 5.1274 1.8697 2.6594 1.3755 3.2466 4.6040 1.4226 4.6011 2.9960 4.7176 2.8078 1.9807 2.1626 1.9962 1.9614 1.2841 1.2727 2.3676 1.4419 1.4371 1.8126 1.2747 1.7283 1.4130 2.3784 1.8121 1.5913 1.4644 1.3904 1.3918 1.9135 1.4893 1.4598 1.4222 2.0452 2.6669 1.1769 1.1929 1.4052 1.0521 1.0593 1.4897 1.5150 1.0511 1.0694 1.2935 1.4210 1.0872 1.3014 7.3204 6.9084 8.9136 9.2354 1.0703 1.0666 1.0649 1.0587 1.0293 1.0342 1.0903 1.0683 1.0969 1.0978 1.0986 1.1045 1.1047 1.0869 1.0914 1.0933 1.1051 1.1049 1.0985
irintensity: 0.3703 0.0978 1.3669 2.4813 0.2087 0.2959 0.1789 0.4213 0.3717 0.5295 2.7120 2.6206 4.1611 5.2630 10.5938 4.9418 6.7945 2.7404 39.6792 1.3253 4.4918 3.3853 5.8024 0.1177 1.8245 1.0580 0.9230 7.6417 4.9764 7.1734 3.0753 11.1002 8.5715 5.2401 18.2087 56.7782 18.7331 25.4983 7.1807 7.5364 11.8482 1.2374 0.4103 9.8757 22.9454 7.2657 42.2349 1.2361 1.9690 13.7697 12.1998 6.2651 32.1192 111.7011 6.7892 1.2459 171.9134 8.6073 1.9926 150.1003 38.9463 23.6077 59.1003 34.2209 77.6474 21.6989 3.7169 10.3556 25.0984 101.7307 49.6554 26.7024 87.5942 34.5535 11.6754 21.5904 25.5629 49.7536 19.0252 13.8447 32.4124 4.7413 5.0265 7.3618 47.8651 13.2154 10.7704 65.0279 20.6990 23.8714 158.0316 209.9358 87.9845 33.5720 44.0253 6.4846 46.3426 30.8507 52.8342 12.1785 9.8971 21.1089 12.3131 26.0552 22.7061 0.2299 18.2118 0.7739 13.5022 17.0961 26.0554
temp: 298.150 k
press: 1.00000 atm
elementType: 8 8 8 8 7 6 6 6 6 6 6 6 6 6 6 6 6 6 6 6 1 1 1 1 1 1 1 1 1 1 1 1 1 1 1 1 1 1 1
symmnumber: 1
zpe: 829251.8 jmol-1
zpe.correction: 0.315845 hartree
zpe.thermalcorrener: 0.336379 hartree
zpe.thermalcorrenthalpy: 0.337323 hartree
zpe.thermalcorrgfe: 0.262966 hartree
zpe.sumelectzpe: -937.134994 hartree
zpe.sumelectthermal: -937.114461 hartree
zpe.sumelectthermalent: -937.113517 hartree
zpe.sumelectthermalfe: -937.187873 hartree
dipole: 2.1200 -3.2130 2.7328
dipole: 4.7208
quadrupole: -103.7530 -116.2095 -119.1917
quadrupole: 5.0605 2.4711 4.8892
quadrupole: 9.2984 -3.1581 -6.1403 5.0605 2.4711 4.8892
hfenergy: -937.4508398 hartree
pointgroup: C01 [X(C15H19N1O4)]
dipole: 1.1281422 -1.0037642 1.0813464 debye
polarizability: 229.5157799|0.9422884|192.068137|-4.7498454|-16.6845658|129.1936894 unknown
InChI: InChI=1S/C15H19NO4/c1-19-13(17)7-9-16-8-6-11-4-3-5-12(15(11)16)10-14(18)20-2/h3-5H,6-10H2,1-2H3
charge 0 multiplicity 1
39 atoms
O  4.308958 -0.098728 0.435932
O  0.502688 2.31377 0.519081
O  3.236023 0.442101 -1.559283
O  -1.010601 3.607283 -0.685463
N  -0.192488 -1.860226 -0.348909
C  -0.359805 -3.052079 0.528068
C  -1.338885 -1.033766 -0.255526
C  -1.896352 -3.187449 0.688394
C  -2.390306 -1.780099 0.376627
C  1.150012 -1.50301 -0.791233
C  -1.592431 0.30028 -0.692977
C  -3.665087 -1.244021 0.572524
C  1.974464 -0.670013 0.242546
C  -2.906238 0.816807 -0.486904
C  -0.587539 1.255632 -1.358352
C  -3.931982 0.079634 0.132166
C  3.196262 -0.058564 -0.408756
C  -0.415015 2.519451 -0.522176
C  5.544845 0.524418 -0.102565
C  0.687839 3.458738 1.444393
H  0.125013 -2.886582 1.516586
H  0.108031 -3.938026 0.061738
H  -2.305287 -3.907571 -0.047411
H  -2.182178 -3.538508 1.694483
H  1.110956 -0.954803 -1.747138
H  1.69096 -2.444691 -1.004583
H  -4.447886 -1.841633 1.054299
H  1.35118 0.169346 0.608537
H  2.275319 -1.274701 1.113485
H  -3.109174 1.842091 -0.821497
H  0.401617 0.80909 -1.518996
H  -0.974204 1.578866 -2.34072
H  -4.922268 0.524565 0.272486
H  6.287789 0.411356 0.699157
H  5.865758 0.004157 -1.020551
H  5.365545 1.587537 -0.334995
H  -0.263405 3.692906 1.951066
H  1.031522 4.346838 0.888381
H  1.44745 3.120507 2.163289
